{"text_format":"1","workbook":"xlsx","n_sheets":7,"sheets":["Users Guide","Farm Bill Calculator","MYA Prices","Background Calculations","ARC-CO Calculations","SCO Coverage","County List"],"not_rendered":{"charts":0,"images":3,"macros":1,"external_links":0,"defined_names":7,"comments":1,"pivot_tables":0},"unopened":[],"bounds":{"document_bytes":16777216,"sheet_cells":100000,"rows_first":2000,"rows_last":500,"rows_between":2000,"halvings":0,"cell_chars":16384,"cell_head_chars":4096},"cells_cut":0,"cells_raw":0,"read":"whole","date_system":"1900"}

{"sheet":"Users Guide","index":0,"n_rows":66,"n_cols":3,"rows_kept":66,"cut":false,"hidden":false,"merged":[]}
[]
[]
[]
[]
[]
[null,null,"MSU 2026 Farm Bill Analyzer USERS GUIDE"]
[null,null,"Version 1.0"]
[null,null,"Michigan State University Extension"]
[null,null,"Based on design created by Roger Betz"]
[]
[null,null,"The MSU FARM BILL ANALYZER provides an analysis of the one important decision that are included in the Agricultural Act of 2018 (the 2018 Farm Bill).  Owners and/or tenants can elect either the Agricultural Risk Coverage (ARC-CO or ARC-IC) or Price Loss Coverage (PLC) programs for each covered commodity on each of their farms."]
[]
[null,null,"This FARM BILL ANALYZER provides farm management information on the ARC Co versus PLC decisions based on assumptions about county yields and national market prices.  Given the inputted variables listed below, the MSU FARM BILL ANALYZER will calculate the consequences for the farm manager’s alternative decisions the election of ARC-CO or PLC programs. The ARC Individual (ARC-IC) program is not analyzed by the tool but is available in the Farm Bill."]
[]
[null,null,"Disclaimer: This MSU FARM BILL ANALYZER is designed with the most recent information available about the provisions of the current Farm Bill."]
[]
[null,null,"I.     To operate the MSU FARM BILL ANALYZER, the user will need the following information:"]
[null,null,"A.    The Farm Service Agency (FSA) PLC program yields by FSA farm number."]
[null,null,"B.    If the farm has irrigated yields, the irrigated and non-irrigated yields by acres by year need to be separated."]
[null,null,"C.    Assumed county average yields (irrigated and non-irrigated) for the county in which the farm is located."]
[null,null,"D.    Assumed national market year average prices (MYA) for the upcoming season."]
[null,null,"E.    If considering purchase of a Supplemental Coverage Option (SCO) policy, intended planting acres, projected premiums and indemnity payments"]
[]
[null,null,"II.    Operation of the tool:"]
[null,null,"A.    The green colored cells are where data and information can be entered. All non-green cells are protected from changes. "]
[null,null,"B.    Where the program says to < SELECT, highlight the green colored cells to the left by clicking on it and a \"scroll button\" will appear to make your selection. Click on the \"scroll button\" to activate the choices."]
[null,null,"   C.    The tool has several grey colored buttons to perform various macros contained with in the spreadsheet."]
[null,null,"   D.    Various formulas may appear in green cells that can be changed.  It is ok and encouraged to use your own values in these cells.  The various macro buttons will restore these formulas and default values. "]
[]
[null,null,"III.   Steps for Data Entry:  "]
[null,null,"Step 1.     Select from pull down menu the Farm's County. Then enter a farm name of your choice and the FSA Farm Number."]
[null,null,"Step 2.     Enter the farm's PLC program base acres for all covered commodities on the farm. FSA form CCC-861"]
[null,null,"Note: In the Farm Bill, “covered commodities” with base acres in Michigan include barley, oats, and some others. If you have a significant base in these crops, please contact the MSU Extension Farm Business Management team or use one of the other national analyzer programs."]
[null,null,"Step 3.     Enter the farm’s PLC program yield for all covered commodities on the farm. FSA form CCC-861"]
[null,null,"Step 4.     Enter the farm's intended planted acres for all covered commodities on the farm. (Only needed for SCO policy considering, otherwise, may skip)"]
[null,null,"Note:  Intended planted acres are only needed for the Supplemental Coverage Option (SCO) policy consideration. If you do plan to consider purchase of a SCO policy, this step may be skipped."]
[null,null,"Step 4.     Enter assumed county yields for the upcoming crop year"]
[null,null,"Note: You can adjust the county yields by entering different yields directly or adjusting their percentage.  A default for 90% of county yields is available to demonstrate scenarios of significant yield loss."]
[null,null,"Note #2: If a county does not list a yield (i.e., soybeans for Alger county), USDA does not have a recorded county yield on file. Check with your local USDA Farm Service Agency office on how ARC programs are calculated in your specific county."]
[null,null,"Step 6.     Select the SCO coverage level and enter the anticipated payment using the ECO/SCO Payment Estimator from Farmdoc"]
[null,null,"https://farmdoc.illinois.edu/fast-tools/eco-sco-payment-estimator"]
[null,null,"Step 5.     Select or Enter Projected Market Year National Average Prices. (MYA) "]
[null,null,"A.    Various projected prices from alternative sources can be chosen by using the “drop-down” menu. "]
[null,null,"B.    The user can also increase or decrease these base price projections by entering the desired percent change."]
[null,null,"C.    The default values can be restored by using the “Restore Default Price Projections” button."]
[]
[null,null,"IV.   FSA Decision:"]
[null,null,"FSA Decision 1:  "]
[null,null,"Based on the inputted values the tool calculates the results. Look for the highest payments for the upcoming year for each crop; corn, soys and wheat.  It is important to test various scenarios to see the impacts of various yields and prices. Low prices and average or high yields usually favors PLC. Low yields and low prices may favor ARC-CO or PLC depending on the crop, the county and levels of low prices and low yields."]
[null,null,"FSA Decision 2: "]
[null,null,"SCO can only be used if a farm selects PLC. SCO is an insurance policy that requires a premium payment in order to receive benefits.  Based on the input anticipated benefit after premium, the tool calculates whether PLC with SCO offers a higher potential payment compared to ARC-CO.  "]
[]
[null,null,"V.    Interpretation of Results: The results calculated by the MSU FARM BILL ANALYZER -- Results include:"]
[null,null,"A.       ARC-CO versus PLC: What is the consequence of electing to enroll the farm in ARC-CO or PLC? The MSU FARM BILL ANALYZER compares the farm’s expected total program payment for each covered commodity under each of these two program choices."]
[null,null,"B. Color coding is used to help quickly see which program has the highs payment given the inputted information.  Green is highest and red is lowest program payment choice."]
[]
[null,null,"VI.    Conclusion: "]
[null,null,"Given the many factors that could affect the two major decisions contained in the Farm Bill, users are encouraged to consider:"]
[null,null,"A.         Running a wide range of scenarios for prices and yields for the upcoming year. Use the best information available for the upcoming year as sign up deadline is March 15th of the crop year decision.   Testing various prices and yields is highly recommended and the calculator is designed to accommodate this testing of the USDA program."]
[null,null,"B.     The farm managers risk preference will effect the final decision made; not simply the result from the most likely prices and yields.  What happens when prices and/or yields?"]
[]
[null,null,"MSU Farm Bill ARC-PLC Decision Making Tool © 2025 Michigan State University Board of Trustees. 4-H and other Cooperative Extension System groups and other nonprofit educational groups may print hard copies of this material for noncommercial, educational use, provided that attribution is given to Michigan State University Extension. All other rights reserved. For information, contact MSU Extension, 108 Agriculture Hall, 446 West Circle Drive, East Lansing, MI 48824."]
[]
[null,null,"Michigan State University Extension programs and materials are open to all without regard to race, color, national origin, gender, gender identity, religion, age, height, weight, disability, political beliefs, sexual orientation, marital status, family status or veteran status. Issued in furtherance of MSU Extension work, acts of May 8 and June 30, 1914, in cooperation with the U.S. Department of Agriculture. Quentin Tyler, Director, MSU Extension, East Lansing, MI 48824. This information is for educational purposes only. Reference to commercial products or trade names does not imply endorsement by MSU Extension or bias against those not mentioned."]
[]
[null,null,"VII. Version Updates"]

{"sheet":"Farm Bill Calculator","index":1,"n_rows":39,"n_cols":10,"rows_kept":39,"cut":false,"hidden":false,"merged":[[38,1,38,3],[3,5,3,6],[4,5,4,6],[18,4,18,8],[20,4,20,9],[16,4,16,9],[0,2,0,8],[1,2,1,8],[33,4,33,8],[37,2,37,3],[34,1,34,3],[36,0,37,0],[25,4,25,6],[28,4,28,5],[28,6,28,7],[28,8,28,9],[27,4,27,9],[35,1,35,3],[36,1,36,3]]}
[null,null,"MSU 2026 FARM BILL ANALYZER"]
[null,null,"Version 1.0"]
["Step 1. Select Farm's County"]
[null,"County Farm located:","Alcona","< Select County","Farm Name:","Smith"]
[null,null,null,null,"Farm Number:",1234]
[]
["Step 2. Enter Acres, Yields and Irrigation Percentage (from FSA CCC-861,156) for each farm"]
[null,"Commodity","Corn","Soybeans","Wheat"]
[null,"Base Acres",0,0,0,{"$f":"SUM(C9:E9)","v":0},"Total Base Acres"]
[null," PLC Yield",0,0,0]
[null,"Historical Irrigated Percentage",0,0,0]
[]
[null,null,null,null,"CORN",null,"SOYBEANS",null,"WHEAT"]
[null,null,null,"National Loan Rates",2.2000000000000002,null,6.2,null,3.38]
[null,null,null,"Effective Reference Prices",{"$f":"'Background Calculations'!T41","v":4.4234666666666662},null,{"$f":"'Background Calculations'!T42","v":10.706666666666667},null,{"$f":"'Background Calculations'!T43","v":6.35}]
[null,null,null,"Benchmark Prices",{"$f":"'Background Calculations'!N54","v":5.03},null,{"$f":"'Background Calculations'!N55","v":12.17},null,{"$f":"'Background Calculations'!N56","v":6.98}]
[null,null,null,null,"Benchmark Years 2018 - 2022"]
["Step 3. Enter Anticipated COUNTY Yields"]
[null,null,null,{"$f":"C4","v":"Alcona"},"County Weighted Yield (Irrigated and Dry)"]
[null,null,null,"% Irrigated",{"$f":"C11","v":0},null,{"$f":"D11","v":0},null,{"$f":"E11","v":0}]
[null,null,null,null,"Anticipated COUNTY Yields"]
[null,null,null,null,{"$f":"'Background Calculations'!N34*(1+F22)","v":151.57666666666668},0,{"$f":"'Background Calculations'!N35*(1+H22)","v":36.79999999999999},0,{"$f":"'Background Calculations'!N36*(1+J22)","v":64.273333333333326},0]
[null,null,null,"Percent of Benchmark Yield",{"$f":"E22/'Background Calculations'!N34","v":1},null,{"$f":"G22/'Background Calculations'!N35","v":1},null,{"$f":"I22/'Background Calculations'!N36","v":1}]
[]
["Step 4. Enter or Select Projected Prices"]
[null,null,null,"Base Assumptions for MYA Prices to Use:","Kansas State (2025/2026)",null,null,"< Select Base Prices Source"]
[]
[null,null,null,"Price Change from Base assumptions:","Projected Crop Prices"]
[null,null,null,null,"CORN",null,"SOYBEANS",null,"WHEAT"]
[null,null,null,null,{"$f":"E31*(1+F30)","v":4.12},0,{"$f":"G31*(1+H30)","v":10.25},{"$f":"F30","v":0},{"$f":"I31*(1+J30)","v":5.0599999999999996},{"$f":"H30","v":0}]
[null,null,null,null,{"$f":"VLOOKUP(E26,'MYA Prices'!B4:E14,2,FALSE)","v":4.12},null,{"$f":"VLOOKUP(E26,'MYA Prices'!B4:E14,3,FALSE)","v":10.25},null,{"$f":"VLOOKUP(E26,'MYA Prices'!B4:E14,4,FALSE)","v":5.0599999999999996}]
[null,null,null,"Percent of Benchmark Price",{"$f":"E30/E16","v":0.81908548707753481},null,{"$f":"G30/G16","v":0.84223500410846341},null,{"$f":"I30/I16","v":0.72492836676217753}]
[]
["Step 5. Evaluate the Results",null,null,null,"Program Year Choice?"]
["Per Base Acre","Projected Program Payments",null,null,"CORN","Max Pmt?","SOYBEANS","Max Pmt?","WHEAT","Max Pmt?"]
[null,"PLC",null,null,{"$f":"IF(E30>E14,IF(E30<E15,E15-E30,0)*C10,(E15-E14)*C10)*(0.85)","v":0},{"$f":"IF(E36=((E15-E14)*C10)*0.85,\"Yes\",\"No\")","v":"Yes"},{"$f":"IF(G30>G14,IF(G30<G15,G15-G30,0)*D10,(G15-G14)*D10)*(0.85)","v":0},{"$f":"IF(G36=((G15-G14)*D10)*0.85,\"Yes\",\"No\")","v":"Yes"},{"$f":"IF(I30>I14,IF(I30<I15,I15-I30,0)*E10,(I15-I14)*E10)*(0.85)","v":0},{"$f":"IF(I36=((I15-I14)*E10)*0.85,\"Yes\",\"No\")","v":"Yes"}]
[null,"ARC-CO",null,null,{"$f":"'Background Calculations'!T34*0.85","v":52.437947833333396},{"$f":"IF(E37=('Background Calculations'!R34*0.85),\"Yes\",\"No\")","v":"No"},{"$f":"'Background Calculations'!T35*0.85","v":21.989840000000015},{"$f":"IF(G37=('Background Calculations'!R35*0.85),\"Yes\",\"No\")","v":"No"},{"$f":"'Background Calculations'!T36*0.85","v":45.760042399999996},{"$f":"IF(I37=('Background Calculations'!R36*0.85),\"Yes\",\"No\")","v":"Yes"}]
[null,null,null,null,"NA",null,"NA",null,"NA"]
["Decision Point >","Best PLC or ARC-CO",null,null,{"$f":"MAX(E36:E37)","v":52.437947833333396},null,{"$f":"MAX(G36:G37)","v":21.989840000000015},null,{"$f":"MAX(I36:I37)","v":45.760042399999996}]

{"sheet":"MYA Prices","index":2,"n_rows":30,"n_cols":20,"rows_kept":30,"cut":false,"hidden":true,"merged":[]}
[1,2,3,4,5,6,7,8,9,10,11,12,13,14,15,16,17,18,19,20]
[null,1,2,3,4]
[null,null,"Corn 26/27","SOY 26/27","Wheat 26/27"]
[null,"CBO Baseline",4.05,9.9,5.6]
[null,"FAPRI",4.1900000000000004,10.06,5.33]
[null,"Futures '26 Harvest (as of 9/15/2025)",4.66,10.81,5.63]
[null,"Kansas State (2025/2026)",4.12,10.25,5.0599999999999996]
[null,"USDA/ERS MYA Proj (2026/2027)"]
[null,"USDA/ERS Ag Baseline Projections",4,10,5.9]
[null,"USDA/WASDE (2025/2026)",3.9,10,5.0999999999999996]
[null,"ARC-CO Benchmark Price",{"$f":"'Background Calculations'!N54","v":5.03},{"$f":"'Background Calculations'!N55","v":12.17},{"$f":"'Background Calculations'!N56","v":6.98}]
[null,"Effective Reference Prices",{"$f":"'Farm Bill Calculator'!E15","v":4.4234666666666662},{"$f":"'Farm Bill Calculator'!G15","v":10.706666666666667},{"$f":"'Farm Bill Calculator'!I15","v":6.35}]
[null,"Statutory Reference Prices",4.0999999999999996,10,6.35]
[null,"Average ",{"$f":"AVERAGEIF(C4:C10,\"<>0\")","v":4.1533333333333333},{"$f":"AVERAGEIF(D4:D10,\"<>0\")","v":10.17},{"$f":"AVERAGEIF(E4:E10,\"<>0\")","v":5.4366666666666665}]
[]
[]
[null,null,null,"Updated 8/19/2025"]
[null,null,null,null,null,null,null,null,null,null,null,null,null,null,"UPDATES "]
[null,null,null,"FAPRI - Food and Agricultural Policy Research Institute  (http://www.fapri.missouri.edu/)",null,null,null,null,"http://www.fapri.missouri.edu/"]
[null,null,null,"USDA's Agricultural Projections to 2028",null,null,null,null,null,null,null,null,null,null,null,null," "]
[null,null,null,"CBO's April 2024 Baseline ",null,null,"https://www.cbo.gov/data/baseline-projections-selected-programs#25"]
[]
[null,null,null,"K State Ag Manager",null,null,"https://www.agmanager.info/crop-insurance/risk-management-strategies/projections-and-sources-mya-prices-arc-and-plc-commodity"]
[]
[]
[]
[null,null,null,"https://www.agmanager.info/crop-insurance/risk-management-strategies/mya-price-estimates-updated-arc-and-plc-commodity-0"]
[null,null,null,"https://www.usda.gov/oce/commodity/wasde/"]
[null,null,null,"https://www.fapri.missouri.edu/"]
[null,null,null,"https://www.ers.usda.gov/data-products/season-average-price-forecasts/"]

{"sheet":"Background Calculations","index":3,"n_rows":56,"n_cols":21,"rows_kept":56,"cut":false,"hidden":true,"merged":[[12,2,12,3],[22,1,28,1]]}
[null,null,{"$f":"'Farm Bill Calculator'!C4","v":"Alcona"}]
[null,null,null,"County Trend Yield from FSA ARC-CO",2017,2018,2019,2020,2021,2022,2023,2024,2025,2026]
[null,"all","Corn",{"$f":"'Farm Bill Calculator'!$C$4&C3&B3","v":"AlconaCornall"},{"$f":"IFERROR(VLOOKUP($D3,'ARC-CO Calculations'!$B$5:$Q$289,9,0),0)","v":134.49},{"$f":"IFERROR(VLOOKUP($D3,'ARC-CO Calculations'!$B$5:$Q$289,10,0),0)","v":126.52},{"$f":"IFERROR(VLOOKUP($D3,'ARC-CO Calculations'!$B$5:$Q$289,11,0),0)","v":96.64},{"$f":"IFERROR(VLOOKUP($D3,'ARC-CO Calculations'!$B$5:$Q$289,12,0),0)","v":147.74},{"$f":"IFERROR(VLOOKUP($D3,'ARC-CO Calculations'!$B$5:$Q$289,13,0),0)","v":193.39999999999998},{"$f":"IFERROR(VLOOKUP($D3,'ARC-CO Calculations'!$B$5:$Q$289,14,0),0)","v":155.94},{"$f":"IFERROR(VLOOKUP($D3,'ARC-CO Calculations'!$B$5:$Q$289,15,0),0)","v":142.63999999999999},{"$f":"IFERROR(VLOOKUP($D3,'ARC-CO Calculations'!$B$5:$Q$289,16,0),0)","v":151.05000000000001},{"$f":"IFERROR(VLOOKUP($D3,'ARC-CO Calculations'!$B$5:$R$289,17,0),0)","v":159.45400000000001},{"$f":"IFERROR(VLOOKUP($D3,'ARC-CO Calculations'!$B$5:$S$289,18,0),0)","v":161.79679999999999}]
[null,"all","soybeans",{"$f":"'Farm Bill Calculator'!$C$4&C4&B4","v":"Alconasoybeansall"},{"$f":"IFERROR(VLOOKUP($D4,'ARC-CO Calculations'!$B$5:$Q$289,9,0),0)","v":37},{"$f":"IFERROR(VLOOKUP($D4,'ARC-CO Calculations'!$B$5:$Q$289,10,0),0)","v":35.03},{"$f":"IFERROR(VLOOKUP($D4,'ARC-CO Calculations'!$B$5:$Q$289,11,0),0)","v":35.229999999999997},{"$f":"IFERROR(VLOOKUP($D4,'ARC-CO Calculations'!$B$5:$Q$289,12,0),0)","v":38.200000000000003},{"$f":"IFERROR(VLOOKUP($D4,'ARC-CO Calculations'!$B$5:$Q$289,13,0),0)","v":46.18},{"$f":"IFERROR(VLOOKUP($D4,'ARC-CO Calculations'!$B$5:$Q$289,14,0),0)","v":41.38},{"$f":"IFERROR(VLOOKUP($D4,'ARC-CO Calculations'!$B$5:$Q$289,15,0),0)","v":30.82},{"$f":"IFERROR(VLOOKUP($D4,'ARC-CO Calculations'!$B$5:$Q$289,16,0),0)","v":18.32},{"$f":"IFERROR(VLOOKUP($D4,'ARC-CO Calculations'!$B$5:$R$289,17,0),0)","v":34.979999999999997},{"$f":"IFERROR(VLOOKUP($D4,'ARC-CO Calculations'!$B$5:$S$289,18,0),0)","v":34.335999999999999}]
[null,"all","Wheat",{"$f":"'Farm Bill Calculator'!$C$4&C5&B5","v":"AlconaWheatall"},{"$f":"IFERROR(VLOOKUP($D5,'ARC-CO Calculations'!$B$5:$Q$289,9,0),0)","v":49.32},{"$f":"IFERROR(VLOOKUP($D5,'ARC-CO Calculations'!$B$5:$Q$289,10,0),0)","v":47.83},{"$f":"IFERROR(VLOOKUP($D5,'ARC-CO Calculations'!$B$5:$Q$289,11,0),0)","v":58.66},{"$f":"IFERROR(VLOOKUP($D5,'ARC-CO Calculations'!$B$5:$Q$289,12,0),0)","v":59.68},{"$f":"IFERROR(VLOOKUP($D5,'ARC-CO Calculations'!$B$5:$Q$289,13,0),0)","v":53.93},{"$f":"IFERROR(VLOOKUP($D5,'ARC-CO Calculations'!$B$5:$Q$289,14,0),0)","v":67.72},{"$f":"IFERROR(VLOOKUP($D5,'ARC-CO Calculations'!$B$5:$Q$289,15,0),0)","v":65.42},{"$f":"IFERROR(VLOOKUP($D5,'ARC-CO Calculations'!$B$5:$Q$289,16,0),0)","v":69.3},{"$f":"IFERROR(VLOOKUP($D5,'ARC-CO Calculations'!$B$5:$R$289,17,0),0)","v":63.82},{"$f":"IFERROR(VLOOKUP($D5,'ARC-CO Calculations'!$B$5:$S$289,18,0),0)","v":64.647999999999996}]
[null,"Irrigated","Corn",{"$f":"'Farm Bill Calculator'!$C$4&C6&B6","v":"AlconaCornIrrigated"},{"$f":"IFERROR(VLOOKUP($D6,'ARC-CO Calculations'!$B$5:$Q$289,9,0),0)","v":0},{"$f":"IFERROR(VLOOKUP($D6,'ARC-CO Calculations'!$B$5:$Q$289,10,0),0)","v":0},{"$f":"IFERROR(VLOOKUP($D6,'ARC-CO Calculations'!$B$5:$Q$289,11,0),0)","v":0},{"$f":"IFERROR(VLOOKUP($D6,'ARC-CO Calculations'!$B$5:$Q$289,12,0),0)","v":0},{"$f":"IFERROR(VLOOKUP($D6,'ARC-CO Calculations'!$B$5:$Q$289,13,0),0)","v":0},{"$f":"IFERROR(VLOOKUP($D6,'ARC-CO Calculations'!$B$5:$Q$289,14,0),0)","v":0},{"$f":"IFERROR(VLOOKUP($D6,'ARC-CO Calculations'!$B$5:$Q$289,15,0),0)","v":0},{"$f":"IFERROR(VLOOKUP($D6,'ARC-CO Calculations'!$B$5:$Q$289,16,0),0)","v":0},{"$f":"IFERROR(VLOOKUP($D6,'ARC-CO Calculations'!$B$5:$R$289,17,0),0)","v":0},{"$f":"IFERROR(VLOOKUP($D6,'ARC-CO Calculations'!$B$5:$S$289,18,0),0)","v":0}]
[null,"Irrigated","soybeans",{"$f":"'Farm Bill Calculator'!$C$4&C7&B7","v":"AlconasoybeansIrrigated"},{"$f":"IFERROR(VLOOKUP($D7,'ARC-CO Calculations'!$B$5:$Q$289,9,0),0)","v":0},{"$f":"IFERROR(VLOOKUP($D7,'ARC-CO Calculations'!$B$5:$Q$289,10,0),0)","v":0},{"$f":"IFERROR(VLOOKUP($D7,'ARC-CO Calculations'!$B$5:$Q$289,11,0),0)","v":0},{"$f":"IFERROR(VLOOKUP($D7,'ARC-CO Calculations'!$B$5:$Q$289,12,0),0)","v":0},{"$f":"IFERROR(VLOOKUP($D7,'ARC-CO Calculations'!$B$5:$Q$289,13,0),0)","v":0},{"$f":"IFERROR(VLOOKUP($D7,'ARC-CO Calculations'!$B$5:$Q$289,14,0),0)","v":0},{"$f":"IFERROR(VLOOKUP($D7,'ARC-CO Calculations'!$B$5:$Q$289,15,0),0)","v":0},{"$f":"IFERROR(VLOOKUP($D7,'ARC-CO Calculations'!$B$5:$Q$289,16,0),0)","v":0},{"$f":"IFERROR(VLOOKUP($D7,'ARC-CO Calculations'!$B$5:$R$289,17,0),0)","v":0},{"$f":"IFERROR(VLOOKUP($D7,'ARC-CO Calculations'!$B$5:$S$289,18,0),0)","v":0}]
[null,"nonirrigated","Corn",{"$f":"'Farm Bill Calculator'!$C$4&C8&B8","v":"AlconaCornnonirrigated"},{"$f":"IFERROR(VLOOKUP($D8,'ARC-CO Calculations'!$B$5:$Q$289,9,0),0)","v":0},{"$f":"IFERROR(VLOOKUP($D8,'ARC-CO Calculations'!$B$5:$Q$289,10,0),0)","v":0},{"$f":"IFERROR(VLOOKUP($D8,'ARC-CO Calculations'!$B$5:$Q$289,11,0),0)","v":0},{"$f":"IFERROR(VLOOKUP($D8,'ARC-CO Calculations'!$B$5:$Q$289,12,0),0)","v":0},{"$f":"IFERROR(VLOOKUP($D8,'ARC-CO Calculations'!$B$5:$Q$289,13,0),0)","v":0},{"$f":"IFERROR(VLOOKUP($D8,'ARC-CO Calculations'!$B$5:$Q$289,14,0),0)","v":0},{"$f":"IFERROR(VLOOKUP($D8,'ARC-CO Calculations'!$B$5:$Q$289,15,0),0)","v":0},{"$f":"IFERROR(VLOOKUP($D8,'ARC-CO Calculations'!$B$5:$Q$289,16,0),0)","v":0},{"$f":"IFERROR(VLOOKUP($D8,'ARC-CO Calculations'!$B$5:$R$289,17,0),0)","v":0},{"$f":"IFERROR(VLOOKUP($D8,'ARC-CO Calculations'!$B$5:$S$289,18,0),0)","v":0}]
[null,"nonirrigated","soybeans",{"$f":"'Farm Bill Calculator'!$C$4&C9&B9","v":"Alconasoybeansnonirrigated"},{"$f":"IFERROR(VLOOKUP($D9,'ARC-CO Calculations'!$B$5:$Q$289,9,0),0)","v":0},{"$f":"IFERROR(VLOOKUP($D9,'ARC-CO Calculations'!$B$5:$Q$289,10,0),0)","v":0},{"$f":"IFERROR(VLOOKUP($D9,'ARC-CO Calculations'!$B$5:$Q$289,11,0),0)","v":0},{"$f":"IFERROR(VLOOKUP($D9,'ARC-CO Calculations'!$B$5:$Q$289,12,0),0)","v":0},{"$f":"IFERROR(VLOOKUP($D9,'ARC-CO Calculations'!$B$5:$Q$289,13,0),0)","v":0},{"$f":"IFERROR(VLOOKUP($D9,'ARC-CO Calculations'!$B$5:$Q$289,14,0),0)","v":0},{"$f":"IFERROR(VLOOKUP($D9,'ARC-CO Calculations'!$B$5:$Q$289,15,0),0)","v":0},{"$f":"IFERROR(VLOOKUP($D9,'ARC-CO Calculations'!$B$5:$Q$289,16,0),0)","v":0},{"$f":"IFERROR(VLOOKUP($D9,'ARC-CO Calculations'!$B$5:$R$289,17,0),0)","v":0},{"$f":"IFERROR(VLOOKUP($D9,'ARC-CO Calculations'!$B$5:$S$289,18,0),0)","v":0}]
[null,"Irrigated","Wheat",{"$f":"'Farm Bill Calculator'!$C$4&C10&B10","v":"AlconaWheatIrrigated"},{"$f":"IFERROR(VLOOKUP($D10,'ARC-CO Calculations'!$B$5:$Q$289,9,0),0)","v":0},{"$f":"IFERROR(VLOOKUP($D10,'ARC-CO Calculations'!$B$5:$Q$289,10,0),0)","v":0},{"$f":"IFERROR(VLOOKUP($D10,'ARC-CO Calculations'!$B$5:$Q$289,11,0),0)","v":0},{"$f":"IFERROR(VLOOKUP($D10,'ARC-CO Calculations'!$B$5:$Q$289,12,0),0)","v":0},{"$f":"IFERROR(VLOOKUP($D10,'ARC-CO Calculations'!$B$5:$Q$289,13,0),0)","v":0},{"$f":"IFERROR(VLOOKUP($D10,'ARC-CO Calculations'!$B$5:$Q$289,14,0),0)","v":0},{"$f":"IFERROR(VLOOKUP($D10,'ARC-CO Calculations'!$B$5:$Q$289,15,0),0)","v":0},{"$f":"IFERROR(VLOOKUP($D10,'ARC-CO Calculations'!$B$5:$Q$289,16,0),0)","v":0},{"$f":"IFERROR(VLOOKUP($D10,'ARC-CO Calculations'!$B$5:$R$289,17,0),0)","v":0},{"$f":"IFERROR(VLOOKUP($D10,'ARC-CO Calculations'!$B$5:$S$289,18,0),0)","v":0}]
[null,"nonirrigated","Wheat",{"$f":"'Farm Bill Calculator'!$C$4&C11&B11","v":"AlconaWheatnonirrigated"},{"$f":"IFERROR(VLOOKUP($D11,'ARC-CO Calculations'!$B$5:$Q$289,9,0),0)","v":0},{"$f":"IFERROR(VLOOKUP($D11,'ARC-CO Calculations'!$B$5:$Q$289,10,0),0)","v":0},{"$f":"IFERROR(VLOOKUP($D11,'ARC-CO Calculations'!$B$5:$Q$289,11,0),0)","v":0},{"$f":"IFERROR(VLOOKUP($D11,'ARC-CO Calculations'!$B$5:$Q$289,12,0),0)","v":0},{"$f":"IFERROR(VLOOKUP($D11,'ARC-CO Calculations'!$B$5:$Q$289,13,0),0)","v":0},{"$f":"IFERROR(VLOOKUP($D11,'ARC-CO Calculations'!$B$5:$Q$289,14,0),0)","v":0},{"$f":"IFERROR(VLOOKUP($D11,'ARC-CO Calculations'!$B$5:$Q$289,15,0),0)","v":0},{"$f":"IFERROR(VLOOKUP($D11,'ARC-CO Calculations'!$B$5:$Q$289,16,0),0)","v":0},{"$f":"IFERROR(VLOOKUP($D11,'ARC-CO Calculations'!$B$5:$R$289,17,0),0)","v":0},{"$f":"IFERROR(VLOOKUP($D11,'ARC-CO Calculations'!$B$5:$S$289,18,0),0)","v":0}]
[]
[null,null,"County Olympic Average Yield ARC-CO",null,2017,2018,2019,2020,2021,2022,2023,2024,2025,2026]
[null,null,"Corn",{"$f":"D3","v":"AlconaCornall"},null,null,{"$f":"(SUM(E3:E3)-MAX(E3:E3)-MIN(E3:E3))/3","v":-44.830000000000005},{"$f":"(SUM(E3:F3)-MAX(E3:F3)-MIN(E3:F3))/3","v":-4.736951571734001E-15},{"$f":"(SUM(E3:G3)-MAX(E3:G3)-MIN(E3:G3))/3","v":42.173333333333325},{"$f":"(SUM(E3:H3)-MAX(E3:H3)-MIN(E3:H3))/3","v":87.00333333333333},{"$f":"(SUM(E3:I3)-MAX(E3:I3)-MIN(E3:I3))/3","v":136.25},{"$f":"(SUM(F3:J3)-MAX(F3:J3)-MIN(F3:J3))/3","v":143.4},{"$f":"(SUM(G3:K3)-MAX(G3:K3)-MIN(G3:K3))/3","v":148.77333333333334},{"$f":"(SUM(H3:L3)-MAX(H3:L3)-MIN(H3:L3))/3","v":151.57666666666668}]
[null,null,"soybeans","Alconasoybeansall",null,null,{"$f":"((SUM(E4:E4)-MAX(E4:E4)-MIN(E4:E4)))/3","v":-12.333333333333334},{"$f":"(SUM(E4:F4)-MAX(E4:F4)-MIN(E4:F4))/3","v":0},{"$f":"(SUM(E4:G4)-MAX(E4:G4)-MIN(E4:G4))/3","v":11.743333333333331},24.076666666666657,{"$f":"(SUM(E4:I4)-MAX(E4:I4)-MIN(E4:I4))/3","v":36.809999999999995},{"$f":"(SUM(F4:J4)-MAX(F4:J4)-MIN(F4:J4))/3","v":38.269999999999989},{"$f":"(SUM(G4:K4)-MAX(G4:K4)-MIN(G4:K4))/3","v":38.270000000000003},{"$f":"(SUM(H4:L4)-MAX(H4:L4)-MIN(H4:L4))/3","v":36.79999999999999}]
[null,null,"Wheat","AlconaWheatall",null,null,{"$f":"(SUM(E5:E5)-MAX(E5:E5)-MIN(E5:E5))/3","v":-16.440000000000001},2.3684757858670005E-15,16.440000000000001,35.993333333333332,53.970000000000006,57.423333333333325,61.253333333333337,64.273333333333326]
[null,null,"Corn","AlconaCornIrrigated",null,null,{"$f":"(SUM(E6:E6)-MAX(E6:E6)-MIN(E6:E6))/3","v":0},0,0,{"$f":"(SUM(E6:H6)-MAX(E6:H6)-MIN(E6:H6))/3","v":0},{"$f":"(SUM(E6:I6)-MAX(E6:I6)-MIN(E6:I6))/3","v":0},0,0,0]
[null,null,"soybeans","AlconasoybeansIrrigated",null,null,{"$f":"(SUM(E7:E7)-MAX(E7:E7)-MIN(E7:E7))/3","v":0},0,0,0,0,0,0,0]
[null,null,"Corn",{"$f":"D8","v":"AlconaCornnonirrigated"},null,null,{"$f":"(SUM(E8:E8)-MAX(E8:E8)-MIN(E8:E8))/3","v":0},0,0,0,0,0,0,0]
[null,null,"soybeans",{"$f":"D9","v":"Alconasoybeansnonirrigated"},null,null,{"$f":"(SUM(E9:E9)-MAX(E9:E9)-MIN(E9:E9))/3","v":0},0,0,0,0,0,0,0]
[null,null,null,{"$f":"D10","v":"AlconaWheatIrrigated"},null,null,{"$f":"(SUM(E10:E10)-MAX(E10:E10)-MIN(E10:E10))/3","v":0},{"$f":"(SUM(E10:F10)-MAX(E10:F10)-MIN(E10:F10))/3","v":0},{"$f":"(SUM(E10:G10)-MAX(E10:G10)-MIN(E10:G10))/3","v":0},{"$f":"(SUM(E10:H10)-MAX(E10:H10)-MIN(E10:H10))/3","v":0},{"$f":"(SUM(E10:I10)-MAX(E10:I10)-MIN(E10:I10))/3","v":0},0,0,0]
[null,null," FSA County Trend Yields for Arc Co NOT USED","AlconaWheatnonirrigated",null,null,0,0,0,0,0,0,0,0]
[null,"Problem Irrigated Yields for counties with out irrigated history back to 2013","Corn",0,null,null,0,0,0,0,0,0,0,0]
[null,null,"soybeans",0,null,null,-672.33333333333337,0,672.66666666666663,1345.6666666666667,2019,2020,2021,2022]
[null,null,"Wheat","AlconaCornall",null,null,0,0,14.943333333333335,0,-2.3684757858670005E-15,14.057777777777771,43.05888888888888,88.475555555555545]
[null,null,"Corn","Alconasoybeansall",null,null,0,0,4.1111111111111116,0,0,3.9144444444444435,11.939999999999998,24.209999999999997]
[null,null,"soybeans","AlconaWheatall",null,null,0,0,5.48,0,0,5.4800000000000031,17.477777777777778,35.467777777777776]
[null,null,"Corn","AlconaCornIrrigated",null,null,0,0,0,0,0,0,0,0]
[null,null,"soybeans","AlconasoybeansIrrigated",null,null,0,0,0,0,0,0,0,0]
[null,null,"Wheat",{"$f":"D10","v":"AlconaWheatIrrigated"},null,null,{"$f":"(SUM(E19:E19)-MAX(E19:E19)-MIN(E19:E19))/3","v":0},{"$f":"(SUM(E19:F19)-MAX(E19:F19)-MIN(E19:F19))/3","v":0},0,0,{"$f":"(SUM(E10:I10)-MAX(E10:I10)-MIN(E10:I10))/3","v":0},0,{"$f":"(SUM(G10:K10)-MAX(G10:K10)-MIN(G10:K10))/3","v":0},{"$f":"(SUM(H10:L10)-MAX(H10:L10)-MIN(H10:L10))/3","v":0}]
[null,null,"Wheat",{"$f":"D11","v":"AlconaWheatnonirrigated"},null,null,0,0,0,0,{"$f":"(SUM(E11:I11)-MAX(E11:I11)-MIN(E11:I11))/3","v":0},0,{"$f":"(SUM(G11:K11)-MAX(G11:K11)-MIN(G11:K11))/3","v":0},{"$f":"(SUM(H11:L11)-MAX(H11:L11)-MIN(H11:L11))/3","v":0}]
[]
[null,null,"County Benchmark Weighted Olympic average Yield",null,2017,2018,2019,2020,2021,2022,2023,2024,2025,2026,null,"Benchmark Revenue","Benchmark Guarantee","Cap Rate","Actual Revenue","Projected Payment"]
[null,null,null,"Corn",{"$f":"('Background Calculations'!E$14)+('Background Calculations'!E17*'Farm Bill Calculator'!$C$11)+('Background Calculations'!E19*(1-'Farm Bill Calculator'!$C$11))","v":0},{"$f":"('Background Calculations'!F$14)+('Background Calculations'!F17*'Farm Bill Calculator'!$C$11)+('Background Calculations'!F19*(1-'Farm Bill Calculator'!$C$11))","v":0},{"$f":"('Background Calculations'!G$14)+('Background Calculations'!G17*'Farm Bill Calculator'!$C$11)+('Background Calculations'!G19*(1-'Farm Bill Calculator'!$C$11))","v":-44.830000000000005},{"$f":"('Background Calculations'!H$14)+('Background Calculations'!H17*'Farm Bill Calculator'!$C$11)+('Background Calculations'!H19*(1-'Farm Bill Calculator'!$C$11))","v":-4.736951571734001E-15},{"$f":"('Background Calculations'!I$14)+('Background Calculations'!I17*'Farm Bill Calculator'!$C$11)+('Background Calculations'!I19*(1-'Farm Bill Calculator'!$C$11))","v":42.173333333333325},{"$f":"('Background Calculations'!J$14)+('Background Calculations'!J17*'Farm Bill Calculator'!$C$11)+('Background Calculations'!J19*(1-'Farm Bill Calculator'!$C$11))","v":87.00333333333333},{"$f":"('Background Calculations'!K$14)+('Background Calculations'!K17*'Farm Bill Calculator'!$C$11)+('Background Calculations'!K19*(1-'Farm Bill Calculator'!$C$11))","v":136.25},{"$f":"('Background Calculations'!L$14)+('Background Calculations'!L17*'Farm Bill Calculator'!$C$11)+('Background Calculations'!L19*(1-'Farm Bill Calculator'!$C$11))","v":143.4},{"$f":"('Background Calculations'!M$14)+('Background Calculations'!M17*'Farm Bill Calculator'!$C$11)+('Background Calculations'!M19*(1-'Farm Bill Calculator'!$C$11))","v":148.77333333333334},{"$f":"('Background Calculations'!N$14)+('Background Calculations'!N17*'Farm Bill Calculator'!$C$11)+('Background Calculations'!N19*(1-'Farm Bill Calculator'!$C$11))","v":151.57666666666668},null,{"$f":"N34*'MYA Prices'!C11","v":762.4306333333335},{"$f":"P34*0.9","v":686.18757000000016},{"$f":"P34*0.12","v":91.491676000000012},{"$f":"'Farm Bill Calculator'!E30*'Farm Bill Calculator'!E22","v":624.49586666666676},{"$f":"MIN(IF(S34<Q34,Q34-S34,0),R34)","v":61.691703333333407}]
[null,null,null,"Soybeans",{"$f":"('Background Calculations'!E$15)+('Background Calculations'!E$18*'Farm Bill Calculator'!$D$11)+('Background Calculations'!E$20*(1-'Farm Bill Calculator'!$D$11))","v":0},{"$f":"('Background Calculations'!F$15)+('Background Calculations'!F$18*'Farm Bill Calculator'!$D$11)+('Background Calculations'!F$20*(1-'Farm Bill Calculator'!$D$11))","v":0},{"$f":"('Background Calculations'!G$15)+('Background Calculations'!G$18*'Farm Bill Calculator'!$D$11)+('Background Calculations'!G$20*(1-'Farm Bill Calculator'!$D$11))","v":-12.333333333333334},{"$f":"('Background Calculations'!H$15)+('Background Calculations'!H$18*'Farm Bill Calculator'!$D$11)+('Background Calculations'!H$20*(1-'Farm Bill Calculator'!$D$11))","v":0},{"$f":"('Background Calculations'!I$15)+('Background Calculations'!I$18*'Farm Bill Calculator'!$D$11)+('Background Calculations'!I$20*(1-'Farm Bill Calculator'!$D$11))","v":11.743333333333331},{"$f":"('Background Calculations'!J$15)+('Background Calculations'!J$18*'Farm Bill Calculator'!$D$11)+('Background Calculations'!J$20*(1-'Farm Bill Calculator'!$D$11))","v":24.076666666666657},{"$f":"('Background Calculations'!K$15)+('Background Calculations'!K$18*'Farm Bill Calculator'!$D$11)+('Background Calculations'!K$20*(1-'Farm Bill Calculator'!$D$11))","v":36.809999999999995},{"$f":"('Background Calculations'!L$15)+('Background Calculations'!L$18*'Farm Bill Calculator'!$D$11)+('Background Calculations'!L$20*(1-'Farm Bill Calculator'!$D$11))","v":38.269999999999989},{"$f":"('Background Calculations'!M$15)+('Background Calculations'!M$18*'Farm Bill Calculator'!$D$11)+('Background Calculations'!M$20*(1-'Farm Bill Calculator'!$D$11))","v":38.270000000000003},{"$f":"('Background Calculations'!N$15)+('Background Calculations'!N$18*'Farm Bill Calculator'!$D$11)+('Background Calculations'!N$20*(1-'Farm Bill Calculator'!$D$11))","v":36.79999999999999},null,{"$f":"N35*'MYA Prices'!D11","v":447.85599999999988},{"$f":"P35*0.9","v":403.07039999999989},{"$f":"P35*0.12","v":53.742719999999984},{"$f":"'Farm Bill Calculator'!G30*'Farm Bill Calculator'!G22","v":377.19999999999987},{"$f":"MIN(IF(S35<Q35,Q35-S35,0),R35)","v":25.870400000000018}]
[null,null,null,"Wheat",{"$f":"('Background Calculations'!E$16)+('Background Calculations'!E$19*'Farm Bill Calculator'!$E$11)+('Background Calculations'!E$19*(1-'Farm Bill Calculator'!$E$11))","v":0},{"$f":"('Background Calculations'!F$16)+('Background Calculations'!F$19*'Farm Bill Calculator'!$E$11)+('Background Calculations'!F$19*(1-'Farm Bill Calculator'!$E$11))","v":0},{"$f":"('Background Calculations'!G$16)+('Background Calculations'!G$30*'Farm Bill Calculator'!$E$11)+('Background Calculations'!G$31*(1-'Farm Bill Calculator'!$E$11))","v":-16.440000000000001},{"$f":"('Background Calculations'!H$16)+('Background Calculations'!H$30*'Farm Bill Calculator'!$E$11)+('Background Calculations'!H$31*(1-'Farm Bill Calculator'!$E$11))","v":2.3684757858670005E-15},{"$f":"('Background Calculations'!I$16)+('Background Calculations'!I$30*'Farm Bill Calculator'!$E$11)+('Background Calculations'!I$31*(1-'Farm Bill Calculator'!$E$11))","v":16.440000000000001},{"$f":"('Background Calculations'!J$16)+('Background Calculations'!J$30*'Farm Bill Calculator'!$E$11)+('Background Calculations'!J$31*(1-'Farm Bill Calculator'!$E$11))","v":35.993333333333332},{"$f":"('Background Calculations'!K$16)+('Background Calculations'!K$30*'Farm Bill Calculator'!$E$11)+('Background Calculations'!K$31*(1-'Farm Bill Calculator'!$E$11))","v":53.970000000000006},{"$f":"('Background Calculations'!L$16)+('Background Calculations'!L$30*'Farm Bill Calculator'!$E$11)+('Background Calculations'!L$31*(1-'Farm Bill Calculator'!$E$11))","v":57.423333333333325},{"$f":"('Background Calculations'!M$16)+('Background Calculations'!M$30*'Farm Bill Calculator'!$E$11)+('Background Calculations'!M$31*(1-'Farm Bill Calculator'!$E$11))","v":61.253333333333337},{"$f":"('Background Calculations'!N$16)+('Background Calculations'!N$30*'Farm Bill Calculator'!$E$11)+('Background Calculations'!N$31*(1-'Farm Bill Calculator'!$E$11))","v":64.273333333333326},null,{"$f":"N36*'MYA Prices'!E11","v":448.62786666666665},{"$f":"P36*0.9","v":403.76508000000001},{"$f":"P36*0.12","v":53.835343999999999},{"$f":"'Farm Bill Calculator'!I30*'Farm Bill Calculator'!I22","v":325.22306666666663},{"$f":"MIN(IF(S36<Q36,Q36-S36,0),R36)","v":53.835343999999999}]
[]
[]
[null,null,"Actual National Market Year Average Price (MYA)"]
[null,null,null,null,2017,2018,2019,2020,2021,2022,2023,2024,2025,2026,null,"PLC Olympic Average","88% of Olympic Average","115% Cap","Statutory Reference Price","Effective Reference Price","Effective Reference Price Cap"]
[null,null,null,"Corn MYA Producer Price 4.10",3.36,3.61,3.56,4.53,6,6.54,4.55,4.24,null,null,null,{"$f":"(SUM(H41:L41)-MIN(H41:L41)-MAX(H41:L41))/(COUNT(H41:L41)-2)","v":5.0266666666666664},{"$f":"P41*0.88","v":4.4234666666666662},{"$f":"S41*1.15","v":4.714999999999999},4.0999999999999996,{"$f":"IF(Q41>S41,Q41,S41)","v":4.4234666666666662},{"$f":"IF(T41>R41,R41,Q41)","v":4.4234666666666662}]
[null,null,null,"Soy MYA Producer Price 10.00",9.33,8.48,8.57,10.8,13.3,14.2,12.4,10,null,null,null,{"$f":"(SUM(H42:L42)-MIN(H42:L42)-MAX(H42:L42))/(COUNT(H42:L42)-2)","v":12.166666666666666},{"$f":"P42*0.88","v":10.706666666666667},{"$f":"S42*1.15","v":11.5},10,{"$f":"IF(Q42>S42,Q42,S42)","v":10.706666666666667},{"$f":"IF(T42>R42,R42,Q42)","v":10.706666666666667}]
[null,null,null,"Wheat MYA Producer Price 6.35",4.72,5.16,4.58,5.05,7.63,8.83,6.96,5.52,null,null,null,{"$f":"(SUM(H43:L43)-MIN(H43:L43)-MAX(H43:L43))/(COUNT(H43:L43)-2)","v":6.7033333333333305},{"$f":"P43*0.88","v":5.8989333333333311},{"$f":"S43*1.15","v":7.3024999999999993},6.35,{"$f":"IF(Q43>S43,Q43,S43)","v":6.35},{"$f":"IF(T43>R43,R43,Q43)","v":5.8989333333333311}]
[]
[]
[]
[]
[null,null,"Minimum Prices for Revenue Guarantees",null,2017,{"$f":"F40","v":2018},2019,2020,2021,2022,2023,2024,2025,2026]
[null,null,null,"Corn MYA Producer Price 4.10",{"$f":"IF(E41<3.7,3.7,E41)","v":3.7},{"$f":"IF(F41<4.01,4.01,F41)","v":4.01},{"$f":"IF(G41<4.01,4.01,G41)","v":4.01},{"$f":"IF(H41<4.1,4.1,H41)","v":4.53},{"$f":"IF(I41<4.1,4.1,I41)","v":6},{"$f":"IF(J41<4.1,4.1,J41)","v":6.54},4.55,{"$f":"IF(L41<4.1,4.1,L41)","v":4.24}]
[null,null,null,"Soy MYA Producer Price 10.00",{"$f":"IF(E42<8.4,8.4,E42)","v":9.33},{"$f":"IF(F42<9.26,9.26,F42)","v":9.26},{"$f":"IF(G42<9.26,9.26,G42)","v":9.26},{"$f":"IF(H42<10,10,H42)","v":10.8},{"$f":"IF(I42<10,10,I42)","v":13.3},{"$f":"IF(J42<10,10,J42)","v":14.2},12.4,10]
[null,null,null,"Wheat MYA Producer Price 6.35",{"$f":"IF(E43<5.5,5.5,E43)","v":5.5},5.5,6.35,6.35,{"$f":"IF(I43<6.35,6.35,I43)","v":7.63},{"$f":"IF(J43<6.35,6.35,J43)","v":8.83},6.96,{"$f":"IF(L43<6.35,6.35,L43)","v":6.35}]
[]
[null,null,"Benchmark Olympic Price for:",null,null,2018,2019,2020,2021,2022,2023,2024,2025,2026]
[null,null,"Corn",null,null,2.4700000000000002,4.0999999999999996,4.0999999999999996,4.0999999999999996,4.0999999999999996,{"$f":"ROUND(((SUM(E49:I49)-MAX(E49:I49)-MIN(E49:I49))/3),2)","v":4.18},4.8499999999999996,{"$f":"ROUND(((SUM(G49:K49)-MAX(G49:K49)-MIN(G49:K49))/3),2)","v":5.03},{"$f":"ROUND(((SUM(H49:L49)-MAX(H49:L49)-MIN(H49:L49))/3),2)","v":5.03}]
[null,null,"Soys",null,null,6.52,10,10,10,10,10,11.12,{"$f":"ROUND(((SUM(G50:K50)-MAX(G50:K50)-MIN(G50:K50))/3),2)","v":12.17},{"$f":"ROUND(((SUM(H50:L50)-MAX(H50:L50)-MIN(H50:L50))/3),2)","v":12.17}]
[null,null,"Wheat",null,null,3.83,6.35,6.35,6.35,6.35,6.35,6.35,6.72,{"$f":"ROUND(((SUM(H51:L51)-MAX(H51:L51)-MIN(H51:L51))/3),2)","v":6.98}]

{"sheet":"ARC-CO Calculations","index":4,"n_rows":289,"n_cols":31,"rows_kept":289,"cut":false,"hidden":true,"merged":[]}
[null,null,"ARC-CO TREND ADJUSTED YIELDS, BENCHMARK YIELDS AND GUARANTEE REVENUES FOR PROGRAM YEAR 2025",null,null,null,null,null,null,null,null,null,null,null,null,null,null,null,null,null,null,"PROJECTED Program Year 2025 Benchmark Yields and Revenues"]
[null,null,null,null,null,null,null,null,null,null,null,null,null,null,null,null,null,null,null,null,null,"A","B","C","D","E","F","G","H","I","J"]
[null,{"$f":"'Farm Bill Calculator'!C4","v":"Alcona"},null,null,null,null,null,null,null,null,null,null,null,null,null,null,null,null,null,null,null,null,null,"(A * B)","(90% of C)","(12% of C)",null,null,"(F * G)","(D - H), not less than 0","Lesser of E or I (capped at 12% of Benchmark)"]
[null,null,"ST_Cty","State Name","County Name","Sub County","Crop Name","Unit","ARC-CO Yield Designation","2017 trend adjusted (county yield or 80% of T)","2018 trend adjusted (county yield or 80% of T)","2019 trend adjusted (county yield or 80% of T)","2020 trend adjusted (county yield or 80% of T)","2021 trend adjusted (county yield or 80% of T)","2022 trend adjusted (county yield or 80% of T)","2023 trend adjusted (county yield or 80% of T)","2024 trend adjusted (county yield or 80% of T)","Projected 2025 trend adjusted (county yield or 80% of T)","Projected 2026 trend adjusted (county yield or 80% of T)","Trend adjustments 2025",null,"2026 Bench Mark (2019-23 olympic avg)","2026 Bench Mark Price (2018-22 olympic avg)","2026 Benchmark Revenue","2026 Guarantee Revenue","2026 Maximum Payment Rate","Projected 2026 Actual Yield","Projected 2026 National Price","Projected 2026 Actual Revenue","Projected 2026 Formula Payment Rate","Projected 2026 ARC-CO Payment Rate"]
[null,{"$f":"E5&G5&I5","v":"AlconaCornAll"},"26001","Michigan","Alcona","","Corn","Bushel","All",134.49,126.52,96.64,147.74,193.39999999999998,155.94,142.63999999999999,151.05000000000001,{"$f":"AVERAGE(M5:Q5)+T5","v":159.45400000000001},{"$f":"AVERAGE(N5:R5)+T5","v":161.79679999999999},1.3,null,{"$f":"(SUM(M5:Q5)-MIN(M5:Q5)-MAX(M5:Q5))/(COUNT(M5:Q5)-2)","v":151.57666666666668},{"$f":"'Background Calculations'!$M$54","v":5.03},{"$f":"V5*W5","v":762.4306333333335},{"$f":"X5*0.9","v":686.18757000000016},{"$f":"X5*0.12","v":91.491676000000012},{"$f":"'Farm Bill Calculator'!$E$22","v":151.57666666666668},{"$f":"'Farm Bill Calculator'!$E$30","v":4.12},{"$f":"AB5*AA5","v":624.49586666666676},{"$f":"IF(Y5-AC5>0,Y5-AC5,0)","v":61.691703333333407},{"$f":"MIN(AD5,Z5)","v":61.691703333333407}]
[null,"AlgerCornAll","26001","Michigan","Alger","","Corn","Bushel","All",58.4,111,58.49,183.9,110.84,79.53,170.04,65.44,{"$f":"AVERAGE(M6:Q6)+T6","v":121.95},{"$f":"AVERAGE(N6:R6)+T6","v":109.55999999999999},null,null,{"$f":"(SUM(M6:Q6)-MIN(M6:Q6)-MAX(M6:Q6))/(COUNT(M6:Q6)-2)","v":120.13666666666666},{"$f":"'Background Calculations'!$M$54","v":5.03},{"$f":"V6*W6","v":604.2874333333333},{"$f":"X6*0.9","v":543.85869000000002},{"$f":"X6*0.12","v":72.51449199999999},{"$f":"'Farm Bill Calculator'!$E$22","v":151.57666666666668},{"$f":"'Farm Bill Calculator'!$E$30","v":4.12},{"$f":"AB6*AA6","v":624.49586666666676},{"$f":"IF(Y6-AC6>0,Y6-AC6,0)","v":0},{"$f":"MIN(AD6,Z6)","v":0}]
[null,"AlleganCornIrrigated","26001","Michigan","Allegan","","Corn","Bushel","Irrigated",231.01,210.20999999999998,201.81,215.59,210.51,218.26999999999998,235.93,238.09,{"$f":"AVERAGE(M7:Q7)+T7","v":225.33799999999997},227.28759999999997,1.66,null,223.26333333333329,{"$f":"'Background Calculations'!$M$54","v":5.03},1123.0145666666665,1010.7131099999999,134.76174799999998,{"$f":"'Farm Bill Calculator'!$E$22","v":151.57666666666668},{"$f":"'Farm Bill Calculator'!$E$30","v":4.12},624.49586666666676,386.21724333333316,134.76174799999998]
[null,"AlleganCornNonirrigated","26003","Michigan","Allegan","","Corn","Bushel","Nonirrigated",187.24,160.18,162.63999999999999,174.56,185.42,189.18,189.85999999999999,202.06,189.78600000000003,192.8312,1.57,null,188.15333333333342,{"$f":"'Background Calculations'!$M$54","v":5.03},946.41126666666719,851.77014000000054,113.56935200000005,{"$f":"'Farm Bill Calculator'!$E$22","v":151.57666666666668},{"$f":"'Farm Bill Calculator'!$E$30","v":4.12},624.49586666666676,227.27427333333378,113.56935200000005]
[null,"AlpenaCornAll","26003","Michigan","Alpena","","Corn","Bushel","All",150.15,116.72999999999999,124.9,169.39,191.82000000000002,152.13,158.41,138.68,163.60600000000002,162.44919999999999,1.52,null,159.97666666666666,{"$f":"'Background Calculations'!$M$54","v":5.03},804.68263333333334,724.21437000000003,96.561915999999997,{"$f":"'Farm Bill Calculator'!$E$22","v":151.57666666666668},{"$f":"'Farm Bill Calculator'!$E$30","v":4.12},624.49586666666676,99.718503333333274,96.561915999999997]
[null,"AntrimCornAll","26005","Michigan","Antrim","","Corn","Bushel","All",140.73000000000002,115.55,97.14,149.22999999999999,144.06,88.27,150.22,136.78,134.60199999999998,131.67639999999997,0.89,null,143.35666666666665,{"$f":"'Background Calculations'!$M$54","v":5.03},721.08403333333331,648.97563000000002,86.530083999999988,{"$f":"'Farm Bill Calculator'!$E$22","v":151.57666666666668},{"$f":"'Farm Bill Calculator'!$E$30","v":4.12},624.49586666666676,24.479763333333267,24.479763333333267]
[null,"ArenacCornAll","26005","Michigan","Arenac","","Corn","Bushel","All",175.67999999999998,174.92,145.34,155.76,195.7,163.98999999999998,183.99,177.78,177.08399999999997,181.34879999999995,1.64,null,175.25333333333333,{"$f":"'Background Calculations'!$M$54","v":5.03},881.52426666666668,793.37184000000002,105.782912,{"$f":"'Farm Bill Calculator'!$E$22","v":151.57666666666668},{"$f":"'Farm Bill Calculator'!$E$30","v":4.12},624.49586666666676,168.87597333333326,105.782912]
[null,"BaragaCornAll","26005","Michigan","Baraga","","Corn","Bushel","All",84,111,84,140.19999999999999,110.84,84,170.04,65.44,114.104,108.8848,null,null,111.67999999999999,{"$f":"'Background Calculations'!$M$54","v":5.03},561.75040000000001,505.57536000000005,67.410048000000003,{"$f":"'Farm Bill Calculator'!$E$22","v":151.57666666666668},{"$f":"'Farm Bill Calculator'!$E$30","v":4.12},624.49586666666676,0,0]
[null,"BarryCornIrrigated","26005","Michigan","Barry","","Corn","Bushel","Irrigated",205.67000000000002,192.86999999999998,182.63,215.64000000000001,224.51,213.3,211.61,226.68,219.62800000000001,220.4256,1.28,null,217.81666666666669,{"$f":"'Background Calculations'!$M$54","v":5.03},1095.6178333333335,986.05605000000014,131.47414000000001,{"$f":"'Farm Bill Calculator'!$E$22","v":151.57666666666668},{"$f":"'Farm Bill Calculator'!$E$30","v":4.12},624.49586666666676,361.56018333333338,131.47414000000001]
[null,"BarryCornNonirrigated","26005","Michigan","Barry","","Corn","Bushel","Nonirrigated",174.37,150.64000000000001,143.56,166.73,181.76000000000002,181.72,168.35999999999999,197.44,180.44200000000001,183.18440000000001,1.24,null,177.27999999999997,{"$f":"'Background Calculations'!$M$54","v":5.03},891.71839999999986,802.54655999999989,107.00620799999997,{"$f":"'Farm Bill Calculator'!$E$22","v":151.57666666666668},{"$f":"'Farm Bill Calculator'!$E$30","v":4.12},624.49586666666676,178.05069333333313,107.00620799999997]
[null,"BayCornIrrigated","26007","Michigan","Bay","","Corn","Bushel","Irrigated",190,205.41000000000003,185.26,199.03,213.09,192.51000000000002,186.85,193.01,198.738,198.67960000000002,1.84,null,194.85,{"$f":"'Background Calculations'!$M$54","v":5.03},980.09550000000002,882.08595000000003,117.61145999999999,{"$f":"'Farm Bill Calculator'!$E$22","v":151.57666666666668},{"$f":"'Farm Bill Calculator'!$E$30","v":4.12},624.49586666666676,257.59008333333327,117.61145999999999]
[null,"BayCornNonirrigated","26007","Michigan","Bay","","Corn","Bushel","Nonirrigated",179.37,193.44,169.23,171.73000000000002,207.54999999999998,186.79000000000002,195.4,204.05,194.934,199.57480000000001,1.83,null,195.41333333333333,{"$f":"'Background Calculations'!$M$54","v":5.03},982.9290666666667,884.63616000000002,117.951488,{"$f":"'Farm Bill Calculator'!$E$22","v":151.57666666666668},{"$f":"'Farm Bill Calculator'!$E$30","v":4.12},624.49586666666676,260.14029333333326,117.951488]
[null,"BenzieCornAll","26007","Michigan","Benzie","","Corn","Bushel","All",135.26,117.95,101.39,114.30000000000001,161.6,94.72,89.61999999999999,143.18,122.30400000000002,123.90479999999999,1.62,null,117.40000000000002,{"$f":"'Background Calculations'!$M$54","v":5.03},590.52200000000016,531.46980000000019,70.862640000000013,{"$f":"'Farm Bill Calculator'!$E$22","v":151.57666666666668},{"$f":"'Farm Bill Calculator'!$E$30","v":4.12},624.49586666666676,0,0]
[null,"BerrienCornIrrigated","26009","Michigan","Berrien","","Corn","Bushel","Irrigated",242.81,215.38,199.39,214.56,223.94,224.27,229.76999999999998,217.43,224.06399999999999,225.96480000000003,2.0699999999999998,null,221.88000000000002,{"$f":"'Background Calculations'!$M$54","v":5.03},1116.0564000000002,1004.4507600000002,133.92676800000001,{"$f":"'Farm Bill Calculator'!$E$22","v":151.57666666666668},{"$f":"'Farm Bill Calculator'!$E$30","v":4.12},624.49586666666676,379.95489333333342,133.92676800000001]
[null,"BerrienCornNonirrigated","26009","Michigan","Berrien","","Corn","Bushel","Nonirrigated",183.76999999999998,172.69,156.84,165.64000000000001,187.6,183.10999999999999,185.51,164.67,179.26599999999999,181.99119999999999,1.96,null,178.08666666666667,{"$f":"'Background Calculations'!$M$54","v":5.03},895.77593333333346,806.19834000000014,107.49311200000001,{"$f":"'Farm Bill Calculator'!$E$22","v":151.57666666666668},{"$f":"'Farm Bill Calculator'!$E$30","v":4.12},624.49586666666676,181.70247333333339,107.49311200000001]
[null,"BranchCornIrrigated","26009","Michigan","Branch","","Corn","Bushel","Irrigated",204.46,192.68,202.37,207.41,184.74,224.11,213.58,220.72,211.86199999999999,212.75240000000002,1.75,null,213.90333333333331,{"$f":"'Background Calculations'!$M$54","v":5.03},1075.9337666666665,968.34038999999996,129.11205199999998,{"$f":"'Farm Bill Calculator'!$E$22","v":151.57666666666668},{"$f":"'Farm Bill Calculator'!$E$30","v":4.12},624.49586666666676,343.8445233333332,129.11205199999998]
[null,"BranchCornNonirrigated","26011","Michigan","Branch","","Corn","Bushel","Nonirrigated",166.38000000000002,159.22,161.11000000000001,160.30000000000001,169.25,186.29999999999998,170.56,180.68,175.07800000000003,178.03359999999998,1.66,null,173.49666666666675,{"$f":"'Background Calculations'!$M$54","v":5.03},872.68823333333387,785.41941000000054,104.72258800000006,{"$f":"'Farm Bill Calculator'!$E$22","v":151.57666666666668},{"$f":"'Farm Bill Calculator'!$E$30","v":4.12},624.49586666666676,160.92354333333378,104.72258800000006]
[null,"CalhounCornIrrigated","26011","Michigan","Calhoun","","Corn","Bushel","Irrigated",200.6,191,164.60999999999999,189.17999999999998,197.56,222.58,202.31,213.11,206.43800000000005,209.88960000000003,1.49,null,204.32666666666674,{"$f":"'Background Calculations'!$M$54","v":5.03},1027.7631333333338,924.98682000000042,123.33157600000006,{"$f":"'Farm Bill Calculator'!$E$22","v":151.57666666666668},{"$f":"'Farm Bill Calculator'!$E$30","v":4.12},624.49586666666676,300.49095333333366,123.33157600000006]
[null,"CalhounCornNonirrigated","26011","Michigan","Calhoun","","Corn","Bushel","Nonirrigated",145.6,149.11000000000001,138.82000000000002,138.12,169.6,180.85,161.25,180.28,167.43,173.292,1.41,null,170.37666666666667,{"$f":"'Background Calculations'!$M$54","v":5.03},856.99463333333335,771.29516999999998,102.839356,{"$f":"'Farm Bill Calculator'!$E$22","v":151.57666666666668},{"$f":"'Farm Bill Calculator'!$E$30","v":4.12},624.49586666666676,146.79930333333323,102.839356]
[null,"CassCornIrrigated","26013","Michigan","Cass","","Corn","Bushel","Irrigated",224.01,162.44999999999999,195.42999999999998,214.3,211.9,203.99,212.79999999999998,209.28,212.28400000000002,211.88079999999999,1.83,null,211.32666666666668,{"$f":"'Background Calculations'!$M$54","v":5.03},1062.9731333333334,956.67582000000004,127.556776,{"$f":"'Farm Bill Calculator'!$E$22","v":151.57666666666668},{"$f":"'Farm Bill Calculator'!$E$30","v":4.12},624.49586666666676,332.17995333333329,127.556776]
[null,"CassCornNonirrigated","26015","Michigan","Cass","","Corn","Bushel","Nonirrigated",163.49,153.69999999999999,139.09,142.58000000000001,163.32,153.27000000000001,158.44999999999999,145.75,154.17399999999998,156.49279999999999,1.5,null,152.48999999999995,{"$f":"'Background Calculations'!$M$54","v":5.03},767.02469999999983,690.32222999999988,92.042963999999969,{"$f":"'Farm Bill Calculator'!$E$22","v":151.57666666666668},{"$f":"'Farm Bill Calculator'!$E$30","v":4.12},624.49586666666676,65.82636333333312,65.82636333333312]
[null,"CharlevoixCornAll","26015","Michigan","Charlevoix","","Corn","Bushel","All",122.88,118.4,124.61999999999999,148.1,154.72,116.49000000000001,122.05,115.1,132.71199999999999,129.6344,1.42,null,128.88,{"$f":"'Background Calculations'!$M$54","v":5.03},648.26639999999998,583.43975999999998,77.791967999999997,{"$f":"'Farm Bill Calculator'!$E$22","v":151.57666666666668},{"$f":"'Farm Bill Calculator'!$E$30","v":4.12},624.49586666666676,0,0]
[null,"CheboyganCornAll","26015","Michigan","Cheboygan","","Corn","Bushel","All",131,117,110.3,129.9,144.49,105.32,127.73,117.31,124.95,123.96000000000001,null,null,124.98000000000002,{"$f":"'Background Calculations'!$M$54","v":5.03},628.64940000000013,565.78446000000008,75.437928000000014,{"$f":"'Farm Bill Calculator'!$E$22","v":151.57666666666668},{"$f":"'Farm Bill Calculator'!$E$30","v":4.12},624.49586666666676,0,0]
[null,"ChippewaCornAll","26015","Michigan","Chippewa","","Corn","Bushel","All",84,111,93.6,182.7,110.84,93.6,170.04,65.44,124.52399999999997,112.88879999999999,null,null,124.82666666666661,{"$f":"'Background Calculations'!$M$54","v":5.03},627.87813333333304,565.09031999999979,75.345375999999959,{"$f":"'Farm Bill Calculator'!$E$22","v":151.57666666666668},{"$f":"'Farm Bill Calculator'!$E$30","v":4.12},624.49586666666676,0,0]
[null,"ClareCornAll","26015","Michigan","Clare","","Corn","Bushel","All",138.21,144.89000000000001,113.92,165.76000000000002,170.75,140.80000000000001,150.05000000000001,147.72,155.99600000000001,154.04319999999998,0.98,null,154.51,{"$f":"'Background Calculations'!$M$54","v":5.03},777.18529999999998,699.46677,93.262236000000001,{"$f":"'Farm Bill Calculator'!$E$22","v":151.57666666666668},{"$f":"'Farm Bill Calculator'!$E$30","v":4.12},624.49586666666676,74.97090333333324,74.97090333333324]
[null,"ClintonCornIrrigated","26017","Michigan","Clinton","","Corn","Bushel","Irrigated",196.23000000000002,205.65,201.96,204.63,229.34,217.35999999999999,209.74,239.46,221.286,224.61720000000003,1.18,null,218.8133333333333,{"$f":"'Background Calculations'!$M$54","v":5.03},1100.6310666666666,990.56795999999997,132.075728,{"$f":"'Farm Bill Calculator'!$E$22","v":151.57666666666668},{"$f":"'Farm Bill Calculator'!$E$30","v":4.12},624.49586666666676,366.07209333333321,132.075728]
[null,"ClintonCornNonirrigated","26017","Michigan","Clinton","","Corn","Bushel","Nonirrigated",158.06,149.46,155.85000000000002,160.35,190.77,179.76999999999998,179.04,204.45,184.04599999999996,188.78519999999997,1.17,null,183.1933333333333,{"$f":"'Background Calculations'!$M$54","v":5.03},921.4624666666665,829.31621999999982,110.57549599999997,{"$f":"'Farm Bill Calculator'!$E$22","v":151.57666666666668},{"$f":"'Farm Bill Calculator'!$E$30","v":4.12},624.49586666666676,204.82035333333306,110.57549599999997]
[null,"DeltaCornAll","26017","Michigan","Delta","","Corn","Bushel","All",61.98,159.56,65.28,193.04,100.99000000000001,68.12,166.61,54.95,118.38200000000001,103.4504,1.64,null,111.90666666666668,{"$f":"'Background Calculations'!$M$54","v":5.03},562.89053333333345,506.60148000000009,67.546864000000014,{"$f":"'Farm Bill Calculator'!$E$22","v":151.57666666666668},{"$f":"'Farm Bill Calculator'!$E$30","v":4.12},624.49586666666676,0,0]
[null,"DickinsonCornAll","26017","Michigan","Dickinson","","Corn","Bushel","All",80.84,157.62,61.6,180.08,104.96,116.88,173.2,54.22,125.86800000000001,115.02560000000001,null,null,131.67999999999998,{"$f":"'Background Calculations'!$M$54","v":5.03},662.35039999999992,596.1153599999999,79.482047999999992,{"$f":"'Farm Bill Calculator'!$E$22","v":151.57666666666668},{"$f":"'Farm Bill Calculator'!$E$30","v":4.12},624.49586666666676,0,0]
[null,"EatonCornAll","26017","Michigan","Eaton","","Corn","Bushel","All",186.83,163.37,145.76,165.14000000000001,180.56,192.85999999999999,157.94999999999999,200.43,181.34800000000001,184.58959999999999,1.96,null,179.51999999999998,{"$f":"'Background Calculations'!$M$54","v":5.03},902.98559999999998,812.68704000000002,108.358272,{"$f":"'Farm Bill Calculator'!$E$22","v":151.57666666666668},{"$f":"'Farm Bill Calculator'!$E$30","v":4.12},624.49586666666676,188.19117333333327,108.358272]
[null,"EmmetCornAll","26019","Michigan","Emmet","","Corn","Bushel","All",125.34,115.45,86.44,133.6,139.59,109.11999999999999,124.94,117.31,125.85199999999999,124.30240000000001,0.94,null,125.2833333333333,{"$f":"'Background Calculations'!$M$54","v":5.03},630.17516666666654,567.15764999999988,75.621019999999987,{"$f":"'Farm Bill Calculator'!$E$22","v":151.57666666666668},{"$f":"'Farm Bill Calculator'!$E$30","v":4.12},624.49586666666676,0,0]
[null,"GeneseeCornAll","26019","Michigan","Genesee","","Corn","Bushel","All",178.39000000000001,170.26000000000002,148.75,158.63999999999999,178.68,149.91,160.21,167.72,164.78200000000001,166.01040000000003,1.75,null,162.19000000000003,{"$f":"'Background Calculations'!$M$54","v":5.03},815.81570000000022,734.23413000000016,97.897884000000019,{"$f":"'Farm Bill Calculator'!$E$22","v":151.57666666666668},{"$f":"'Farm Bill Calculator'!$E$30","v":4.12},624.49586666666676,109.73826333333341,97.897884000000019]
[null,"GladwinCornAll","26021","Michigan","Gladwin","","Corn","Bushel","All",154.34,175.27,142.53,160.4,189.78,140.89999999999998,170.95,177.92,169.86999999999998,171.76399999999998,1.88,null,169.75666666666666,{"$f":"'Background Calculations'!$M$54","v":5.03},853.87603333333334,768.48842999999999,102.465124,{"$f":"'Farm Bill Calculator'!$E$22","v":151.57666666666668},{"$f":"'Farm Bill Calculator'!$E$30","v":4.12},624.49586666666676,143.99256333333324,102.465124]
[null,"Grand TraverseCornAll","26021","Michigan","Grand Traverse","","Corn","Bushel","All",133.76,89.15,108.14,109.12,155.32999999999998,144.04000000000002,124.28,150.38999999999999,137.71200000000002,143.43039999999999,1.08,null,139.57,{"$f":"'Background Calculations'!$M$54","v":5.03},702.03710000000001,631.83339000000001,84.244451999999995,{"$f":"'Farm Bill Calculator'!$E$22","v":151.57666666666668},{"$f":"'Farm Bill Calculator'!$E$30","v":4.12},624.49586666666676,7.3375233333332517,7.3375233333332517]
[null,"GratiotCornIrrigated","26021","Michigan","Gratiot","","Corn","Bushel","Irrigated",186.67999999999998,196.85000000000002,187.88000000000002,204.31,201.98000000000002,207.38,214.83,218.73,210.86599999999999,212.1772,1.42,null,208.84,{"$f":"'Background Calculations'!$M$54","v":5.03},1050.4652000000001,945.41868000000011,126.055824,{"$f":"'Farm Bill Calculator'!$E$22","v":151.57666666666668},{"$f":"'Farm Bill Calculator'!$E$30","v":4.12},624.49586666666676,320.92281333333335,126.055824]
[null,"GratiotCornNonirrigated","26021","Michigan","Gratiot","","Corn","Bushel","Nonirrigated",164.63,174.91,155.16,173.21,183.23,182.01999999999998,193.65,209.24,189.68,192.97399999999999,1.41,null,186.29999999999998,{"$f":"'Background Calculations'!$M$54","v":5.03},937.08899999999994,843.38009999999997,112.45067999999999,{"$f":"'Farm Bill Calculator'!$E$22","v":151.57666666666668},{"$f":"'Farm Bill Calculator'!$E$30","v":4.12},624.49586666666676,218.88423333333321,112.45067999999999]
[null,"HillsdaleCornIrrigated","26021","Michigan","Hillsdale","","Corn","Bushel","Irrigated",203.81,187.67,202.17000000000002,217.28,195.45999999999998,217.72,219.05,230.51,217.76399999999998,217.86079999999998,1.76,null,218.01666666666665,{"$f":"'Background Calculations'!$M$54","v":5.03},1096.6238333333333,986.96145000000001,131.59485999999998,{"$f":"'Farm Bill Calculator'!$E$22","v":151.57666666666668},{"$f":"'Farm Bill Calculator'!$E$30","v":4.12},624.49586666666676,362.46558333333326,131.59485999999998]
[null,"HillsdaleCornNonirrigated","26023","Michigan","Hillsdale","","Corn","Bushel","Nonirrigated",172.04,164.3,167.10999999999999,158.5,184.91,186.81,175.27,185.4,179.898,184.17760000000001,1.72,null,181.85999999999999,{"$f":"'Background Calculations'!$M$54","v":5.03},914.75580000000002,823.28021999999999,109.770696,{"$f":"'Farm Bill Calculator'!$E$22","v":151.57666666666668},{"$f":"'Farm Bill Calculator'!$E$30","v":4.12},624.49586666666676,198.78435333333323,109.770696]
[null,"HoughtonCornAll","26023","Michigan","Houghton","","Corn","Bushel","All",58.4,111,58.49,138.6,110.84,79.53,170.04,65.44,112.89000000000001,107.748,null,null,109.65666666666668,{"$f":"'Background Calculations'!$M$54","v":5.03},551.57303333333346,496.41573000000011,66.188764000000006,{"$f":"'Farm Bill Calculator'!$E$22","v":151.57666666666668},{"$f":"'Farm Bill Calculator'!$E$30","v":4.12},624.49586666666676,0,0]
[null,"HuronCornIrrigated","26023","Michigan","Huron","","Corn","Bushel","Irrigated",208.45,207.21,209.51000000000002,220.47,219.57,203.53,203.81,228.47,216.70999999999998,215.95800000000003,1.54,null,214.61666666666665,{"$f":"'Background Calculations'!$M$54","v":5.03},1079.5218333333332,971.56964999999991,129.54261999999997,{"$f":"'Farm Bill Calculator'!$E$22","v":151.57666666666668},{"$f":"'Farm Bill Calculator'!$E$30","v":4.12},624.49586666666676,347.07378333333315,129.54261999999997]
[null,"HuronCornNonirrigated","26023","Michigan","Huron","","Corn","Bushel","Nonirrigated",205.28,178.93,182.14000000000001,201.86999999999998,224.46,177.97,208.70000000000002,215.07,207.15399999999997,208.21080000000001,1.54,null,208.54666666666662,{"$f":"'Background Calculations'!$M$54","v":5.03},1048.9897333333331,944.09075999999982,125.87876799999997,{"$f":"'Farm Bill Calculator'!$E$22","v":151.57666666666668},{"$f":"'Farm Bill Calculator'!$E$30","v":4.12},624.49586666666676,319.59489333333306,125.87876799999997]
[null,"InghamCornAll","26023","Michigan","Ingham","","Corn","Bushel","All",172.86,159.79,164.27,166.36,199.89,175.46,176.34,197.01,184.87200000000001,188.57440000000003,1.86,null,182.9366666666667,{"$f":"'Background Calculations'!$M$54","v":5.03},920.17143333333354,828.15429000000017,110.42057200000002,{"$f":"'Farm Bill Calculator'!$E$22","v":151.57666666666668},{"$f":"'Farm Bill Calculator'!$E$30","v":4.12},624.49586666666676,203.65842333333342,110.42057200000002]
[null,"IoniaCornIrrigated","26025","Michigan","Ionia","","Corn","Bushel","Irrigated",209.64,218.7,198.65,222.95,241.14000000000001,229.13,225.51,248.03,234.99199999999999,237.40039999999996,1.64,null,231.92666666666665,{"$f":"'Background Calculations'!$M$54","v":5.03},1166.5911333333333,1049.93202,139.990936,{"$f":"'Farm Bill Calculator'!$E$22","v":151.57666666666668},{"$f":"'Farm Bill Calculator'!$E$30","v":4.12},624.49586666666676,425.43615333333321,139.990936]
[null,"IoniaCornNonirrigated","26025","Michigan","Ionia","","Corn","Bushel","Nonirrigated",175.60999999999999,172.12,166.24,165.67000000000002,198.59,202.32,191.95,212.86,195.90799999999999,201.95559999999998,1.63,null,197.62,{"$f":"'Background Calculations'!$M$54","v":5.03},994.0286000000001,894.62574000000006,119.283432,{"$f":"'Farm Bill Calculator'!$E$22","v":151.57666666666668},{"$f":"'Farm Bill Calculator'!$E$30","v":4.12},624.49586666666676,270.12987333333331,119.283432]
[null,"IoscoCornAll","26025","Michigan","Iosco","","Corn","Bushel","All",173.96,163.72999999999999,144.26999999999998,155.35,168.98000000000002,155.76999999999998,168.28,162.63,163.40199999999999,165.01239999999996,1.2,null,162.22666666666666,{"$f":"'Background Calculations'!$M$54","v":5.03},816.00013333333334,734.40012000000002,97.920016000000004,{"$f":"'Farm Bill Calculator'!$E$22","v":151.57666666666668},{"$f":"'Farm Bill Calculator'!$E$30","v":4.12},624.49586666666676,109.90425333333326,97.920016000000004]
[null,"IronCornAll","26025","Michigan","Iron","","Corn","Bushel","All",84,111,84,154.83000000000001,110.84,84,170.04,65.44,117.03000000000002,109.47,null,null,116.55666666666669,{"$f":"'Background Calculations'!$M$54","v":5.03},586.28003333333345,527.65203000000008,70.353604000000004,{"$f":"'Farm Bill Calculator'!$E$22","v":151.57666666666668},{"$f":"'Farm Bill Calculator'!$E$30","v":4.12},624.49586666666676,0,0]
[null,"IsabellaCornIrrigated","26025","Michigan","Isabella","","Corn","Bushel","Irrigated",183.39,188.31,176.70999999999998,179.95000000000002,193.12,143.15,151.94999999999999,178.75,171.21400000000003,169.46680000000003,1.83,null,170.2166666666667,{"$f":"'Background Calculations'!$M$54","v":5.03},856.18983333333358,770.57085000000029,102.74278000000002,{"$f":"'Farm Bill Calculator'!$E$22","v":151.57666666666668},{"$f":"'Farm Bill Calculator'!$E$30","v":4.12},624.49586666666676,146.07498333333353,102.74278000000002]
[null,"IsabellaCornNonirrigated","26027","Michigan","Isabella","","Corn","Bushel","Nonirrigated",165.05,154.57999999999998,149.08999999999997,137.55000000000001,189.45000000000002,174.51000000000002,176.62,189.25,175.286,182.83320000000001,1.81,null,180.12666666666664,{"$f":"'Background Calculations'!$M$54","v":5.03},906.03713333333326,815.43341999999996,108.72445599999999,{"$f":"'Farm Bill Calculator'!$E$22","v":151.57666666666668},{"$f":"'Farm Bill Calculator'!$E$30","v":4.12},624.49586666666676,190.9375533333332,108.72445599999999]
[null,"JacksonCornIrrigated","26027","Michigan","Jackson","","Corn","Bushel","Irrigated",231.79,210.79999999999998,209.27999999999997,221.03,196.25,195.94,229.31,216.88,213.44199999999998,211.92439999999999,1.56,null,211.38666666666663,{"$f":"'Background Calculations'!$M$54","v":5.03},1063.2749333333331,956.9474399999998,127.59299199999997,{"$f":"'Farm Bill Calculator'!$E$22","v":151.57666666666668},{"$f":"'Farm Bill Calculator'!$E$30","v":4.12},624.49586666666676,332.45157333333304,127.59299199999997]
[null,"JacksonCornNonirrigated","26027","Michigan","Jackson","","Corn","Bushel","Nonirrigated",134.13,137.18,160.51999999999998,140.80000000000001,169.78,170.12,169.43,174.59,166.42400000000001,171.54879999999997,1.48,null,169.77666666666667,{"$f":"'Background Calculations'!$M$54","v":5.03},853.97663333333344,768.57897000000014,102.47719600000001,{"$f":"'Farm Bill Calculator'!$E$22","v":151.57666666666668},{"$f":"'Farm Bill Calculator'!$E$30","v":4.12},624.49586666666676,144.08310333333338,102.47719600000001]
[null,"KalamazooCornIrrigated","26027","Michigan","Kalamazoo","","Corn","Bushel","Irrigated",220.53,161.55000000000001,196.91,220.08,225.07000000000002,218.14,213.2,235.93,224.114,224.92080000000004,1.63,null,221.09666666666666,{"$f":"'Background Calculations'!$M$54","v":5.03},1112.1162333333334,1000.90461,133.453948,{"$f":"'Farm Bill Calculator'!$E$22","v":151.57666666666668},{"$f":"'Farm Bill Calculator'!$E$30","v":4.12},624.49586666666676,376.40874333333329,133.453948]
[null,"KalamazooCornNonirrigated","26027","Michigan","Kalamazoo","","Corn","Bushel","Nonirrigated",151.81,153.4,146.44,143.38000000000002,174.45,172.70999999999998,165.45999999999998,186.44,169.898,175.20159999999998,1.41,null,170.87333333333336,{"$f":"'Background Calculations'!$M$54","v":5.03},859.49286666666683,773.54358000000013,103.13914400000002,{"$f":"'Farm Bill Calculator'!$E$22","v":151.57666666666668},{"$f":"'Farm Bill Calculator'!$E$30","v":4.12},624.49586666666676,149.04771333333338,103.13914400000002]
[null,"KalkaskaCornAll","26029","Michigan","Kalkaska","","Corn","Bushel","All",129,111,62.4,104.2,120.23,133.69,154.05000000000001,166.09,135.65200000000002,141.94240000000002,null,null,135.99,{"$f":"'Background Calculations'!$M$54","v":5.03},684.02970000000005,615.62673000000007,82.08356400000001,{"$f":"'Farm Bill Calculator'!$E$22","v":151.57666666666668},{"$f":"'Farm Bill Calculator'!$E$30","v":4.12},624.49586666666676,0,0]
[null,"KentCornIrrigated","26029","Michigan","Kent","","Corn","Bushel","Irrigated",205.72,170.59,185.17,203.51,205.24,217.79,221.84,216.83,214.78200000000001,217.03640000000001,1.74,null,213.28666666666666,{"$f":"'Background Calculations'!$M$54","v":5.03},1072.8319333333334,965.54874000000007,128.73983200000001,{"$f":"'Farm Bill Calculator'!$E$22","v":151.57666666666668},{"$f":"'Farm Bill Calculator'!$E$30","v":4.12},624.49586666666676,341.05287333333331,128.73983200000001]
[null,"KentCornNonirrigated","26029","Michigan","Kent","","Corn","Bushel","Nonirrigated",158.54000000000002,151.22,154.85,172.73,189.47,181.76999999999998,177.3,192.83,184.51999999999998,186.87799999999999,1.7,null,182.84666666666666,{"$f":"'Background Calculations'!$M$54","v":5.03},919.71873333333338,827.74686000000008,110.366248,{"$f":"'Farm Bill Calculator'!$E$22","v":151.57666666666668},{"$f":"'Farm Bill Calculator'!$E$30","v":4.12},624.49586666666676,203.25099333333333,110.366248]
[null,"LakeCornAll","26031","Michigan","Lake","","Corn","Bushel","All",140,78.17,138.51,154.4,157.86000000000001,158.28,148.83000000000001,166.97,157.268,157.84160000000003,null,null,156.84666666666666,{"$f":"'Background Calculations'!$M$54","v":5.03},788.9387333333334,710.04486000000009,94.672648000000009,{"$f":"'Farm Bill Calculator'!$E$22","v":151.57666666666668},{"$f":"'Farm Bill Calculator'!$E$30","v":4.12},624.49586666666676,85.548993333333328,85.548993333333328]
[null,"LapeerCornAll","26031","Michigan","Lapeer","","Corn","Bushel","All",194.26,184.31,155.57,181.57999999999998,193.42000000000002,161.23000000000002,164.75,182.94,178.87400000000002,178.33280000000005,2.09,null,176.42333333333332,{"$f":"'Background Calculations'!$M$54","v":5.03},887.40936666666664,798.66842999999994,106.48912399999999,{"$f":"'Farm Bill Calculator'!$E$22","v":151.57666666666668},{"$f":"'Farm Bill Calculator'!$E$30","v":4.12},624.49586666666676,174.17256333333319,106.48912399999999]
[null,"LeelanauCornAll","26031","Michigan","Leelanau","","Corn","Bushel","All",118.07000000000001,100.33999999999999,109.46000000000001,135.26000000000002,152.05000000000001,119.16,77.94,83.92,114.626,110.4992,0.96,null,112.78000000000002,{"$f":"'Background Calculations'!$M$54","v":5.03},567.28340000000014,510.55506000000014,68.074008000000021,{"$f":"'Farm Bill Calculator'!$E$22","v":151.57666666666668},{"$f":"'Farm Bill Calculator'!$E$30","v":4.12},624.49586666666676,0,0]
[null,"LenaweeCornIrrigated","26033","Michigan","Lenawee","","Corn","Bushel","Irrigated",232.36,211.03,219.54000000000002,219.17000000000002,213.62,231.35,239.9,211.17,224.602,225.6884,1.56,null,221.38000000000002,{"$f":"'Background Calculations'!$M$54","v":5.03},1113.5414000000001,1002.18726,133.624968,{"$f":"'Farm Bill Calculator'!$E$22","v":151.57666666666668},{"$f":"'Farm Bill Calculator'!$E$30","v":4.12},624.49586666666676,377.69139333333328,133.624968]
[null,"LenaweeCornNonirrigated","26033","Michigan","Lenawee","","Corn","Bushel","Nonirrigated",189.24,167.71,179.37,172.6,196.48,194.82,199.15,182.21,190.602,194.20240000000001,1.55,null,191.17,{"$f":"'Background Calculations'!$M$54","v":5.03},961.58510000000001,865.42659000000003,115.39021199999999,{"$f":"'Farm Bill Calculator'!$E$22","v":151.57666666666668},{"$f":"'Farm Bill Calculator'!$E$30","v":4.12},624.49586666666676,240.93072333333328,115.39021199999999]
[null,"LivingstonCornAll","26033","Michigan","Livingston","","Corn","Bushel","All",167.78,139.72,172.15,173.89,184.07,164.32000000000002,190.14999999999998,205.79,185.49399999999997,187.81479999999996,1.85,null,182.70333333333329,{"$f":"'Background Calculations'!$M$54","v":5.03},918.99776666666651,827.09798999999987,110.27973199999998,{"$f":"'Farm Bill Calculator'!$E$22","v":151.57666666666668},{"$f":"'Farm Bill Calculator'!$E$30","v":4.12},624.49586666666676,202.60212333333311,110.27973199999998]
[null,"LuceCornAll","26035","Michigan","Luce","","Corn","Bushel","All",61.6,111,61.6,182.4,110.84,79.53,170.04,65.44,121.65,109.5,null,null,120.13666666666666,{"$f":"'Background Calculations'!$M$54","v":5.03},604.2874333333333,543.85869000000002,72.51449199999999,{"$f":"'Farm Bill Calculator'!$E$22","v":151.57666666666668},{"$f":"'Farm Bill Calculator'!$E$30","v":4.12},624.49586666666676,0,0]
[null,"MackinacCornAll","26035","Michigan","Mackinac","","Corn","Bushel","All",61.6,111,61.6,182.9,110.84,79.53,170.04,65.44,121.75,109.51999999999998,null,null,120.13666666666666,{"$f":"'Background Calculations'!$M$54","v":5.03},604.2874333333333,543.85869000000002,72.51449199999999,{"$f":"'Farm Bill Calculator'!$E$22","v":151.57666666666668},{"$f":"'Farm Bill Calculator'!$E$30","v":4.12},624.49586666666676,0,0]
[null,"MacombCornAll","26035","Michigan","Macomb","","Corn","Bushel","All",190.48,190.42000000000002,163.95,173.88000000000002,182.76000000000002,180.66,177.82,180.24,181.13200000000003,182.58240000000001,2.06,null,179.57333333333338,{"$f":"'Background Calculations'!$M$54","v":5.03},903.25386666666691,812.92848000000026,108.39046400000002,{"$f":"'Farm Bill Calculator'!$E$22","v":151.57666666666668},{"$f":"'Farm Bill Calculator'!$E$30","v":4.12},624.49586666666676,188.43261333333351,108.39046400000002]
[null,{"$f":"E69&G69&I69","v":"ManisteeCornAll"},"26037","Michigan","Manistee","","Corn","Bushel","All",127.48,148.52000000000001,111.62,123.07,158.09,164.17,133.41,156.72999999999999,148.60399999999998,153.71079999999998,1.51,null,149.40999999999997,{"$f":"'Background Calculations'!$M$54","v":5.03},751.53229999999985,676.37906999999984,90.183875999999984,{"$f":"'Farm Bill Calculator'!$E$22","v":151.57666666666668},{"$f":"'Farm Bill Calculator'!$E$30","v":4.12},624.49586666666676,51.883203333333086,51.883203333333086]
[null,"MarquetteCornAll","26037","Michigan","Marquette","","Corn","Bushel","All",58.4,111,58.49,184,110.84,79.53,170.04,65.44,{"$f":"AVERAGE(M70:Q70)+T70","v":121.96999999999998},{"$f":"AVERAGE(N70:R70)+T70","v":109.56399999999999},null,null,{"$f":"(SUM(M70:Q70)-MIN(M70:Q70)-MAX(M70:Q70))/(COUNT(M70:Q70)-2)","v":120.13666666666661},{"$f":"'Background Calculations'!$M$54","v":5.03},{"$f":"V70*W70","v":604.28743333333307},{"$f":"X70*0.9","v":543.8586899999998},{"$f":"X70*0.12","v":72.514491999999962},{"$f":"'Farm Bill Calculator'!$E$22","v":151.57666666666668},{"$f":"'Farm Bill Calculator'!$E$30","v":4.12},{"$f":"AB70*AA70","v":624.49586666666676},{"$f":"IF(Y70-AC70>0,Y70-AC70,0)","v":0},{"$f":"MIN(AD70,Z70)","v":0}]
[null,"MasonCornIrrigated","26037","Michigan","Mason","","Corn","Bushel","Irrigated",207.66,186.01999999999998,182.31,202.82,211.55,186.83999999999997,197.8,181.78,198.04799999999997,197.09359999999998,1.89,null,195.82000000000002,{"$f":"'Background Calculations'!$M$54","v":5.03},984.97460000000012,886.47714000000008,118.19695200000001,{"$f":"'Farm Bill Calculator'!$E$22","v":151.57666666666668},{"$f":"'Farm Bill Calculator'!$E$30","v":4.12},624.49586666666676,261.98127333333332,118.19695200000001]
[null,"MasonCornNonirrigated","26037","Michigan","Mason","","Corn","Bushel","Nonirrigated",178.77,139.85,145.52000000000001,165.93,175.62,169.9,145.66,150.19,163.32,162.79799999999997,1.86,null,162.00666666666666,{"$f":"'Background Calculations'!$M$54","v":5.03},814.89353333333338,733.40418000000011,97.787224000000009,{"$f":"'Farm Bill Calculator'!$E$22","v":151.57666666666668},{"$f":"'Farm Bill Calculator'!$E$30","v":4.12},624.49586666666676,108.90831333333335,97.787224000000009]
[null,"MecostaCornIrrigated","26037","Michigan","Mecosta","","Corn","Bushel","Irrigated",196.77,161.75,174.86999999999998,190.84,206.34,186.71,178.42000000000002,177.3,189.62199999999996,189.37839999999997,1.7,null,185.3233333333333,{"$f":"'Background Calculations'!$M$54","v":5.03},932.17636666666647,838.95872999999983,111.86116399999997,{"$f":"'Farm Bill Calculator'!$E$22","v":151.57666666666668},{"$f":"'Farm Bill Calculator'!$E$30","v":4.12},624.49586666666676,214.46286333333308,111.86116399999997]
[null,"MecostaCornNonirrigated","26041","Michigan","Mecosta","","Corn","Bushel","Nonirrigated",134.12,123,122.64,99.8,134.30000000000001,110.63,123.56,125.84,120.386,124.50320000000001,1.56,null,120.00999999999999,{"$f":"'Background Calculations'!$M$54","v":5.03},603.65030000000002,543.28527000000008,72.438035999999997,{"$f":"'Farm Bill Calculator'!$E$22","v":151.57666666666668},{"$f":"'Farm Bill Calculator'!$E$30","v":4.12},624.49586666666676,0,0]
[null,"MenomineeCornAll","26041","Michigan","Menominee","","Corn","Bushel","All",68.2,153.99,66.260000000000005,193.04000000000002,135.17999999999998,80.52,174.62,87.15,134.61199999999999,122.9264,0.51,null,132.31666666666666,{"$f":"'Background Calculations'!$M$54","v":5.03},665.5528333333333,598.99754999999993,79.866339999999994,{"$f":"'Farm Bill Calculator'!$E$22","v":151.57666666666668},{"$f":"'Farm Bill Calculator'!$E$30","v":4.12},624.49586666666676,0,0]
[null,"MidlandCornIrrigated","26041","Michigan","Midland","","Corn","Bushel","Irrigated",183.42,195.51999999999998,190.82000000000002,184.14000000000001,185.41,197.79,206.98000000000002,228.34,202.46200000000002,206.12640000000002,1.93,null,196.72666666666669,{"$f":"'Background Calculations'!$M$54","v":5.03},989.53513333333353,890.58162000000016,118.74421600000002,{"$f":"'Farm Bill Calculator'!$E$22","v":151.57666666666668},{"$f":"'Farm Bill Calculator'!$E$30","v":4.12},624.49586666666676,266.0857533333334,118.74421600000002]
[null,"MidlandCornNonirrigated","26043","Michigan","Midland","","Corn","Bushel","Nonirrigated",168.02999999999997,172.60000000000002,156.47,168.62,182.11,186.35999999999999,179.73,190.04,183.292,186.22639999999998,1.92,null,182.73333333333335,{"$f":"'Background Calculations'!$M$54","v":5.03},919.14866666666683,827.2338000000002,110.29784000000002,{"$f":"'Farm Bill Calculator'!$E$22","v":151.57666666666668},{"$f":"'Farm Bill Calculator'!$E$30","v":4.12},624.49586666666676,202.73793333333344,110.29784000000002]
[null,"MissaukeeCornIrrigated","26045","Michigan","Missaukee","","Corn","Bushel","Irrigated",200.94,197.53,185.76000000000002,215.41,232.41,220.29999999999998,224.08,214.63,222.04599999999999,223.3732,0.68,null,219.92999999999998,{"$f":"'Background Calculations'!$M$54","v":5.03},1106.2478999999998,995.62310999999988,132.74974799999998,{"$f":"'Farm Bill Calculator'!$E$22","v":151.57666666666668},{"$f":"'Farm Bill Calculator'!$E$30","v":4.12},624.49586666666676,371.12724333333313,132.74974799999998]
[null,"MissaukeeCornNonirrigated","26045","Michigan","Missaukee","","Corn","Bushel","Nonirrigated",157.36999999999998,126.34,148.76000000000002,152.05000000000001,205.54,192.39,197.20000000000002,189.3,187.976,195.16120000000001,0.68,null,192.96333333333337,{"$f":"'Background Calculations'!$M$54","v":5.03},970.60556666666685,873.54501000000016,116.47266800000001,{"$f":"'Farm Bill Calculator'!$E$22","v":151.57666666666668},{"$f":"'Farm Bill Calculator'!$E$30","v":4.12},624.49586666666676,249.0491433333334,116.47266800000001]
[null,"MonroeCornIrrigated","26045","Michigan","Monroe","","Corn","Bushel","Irrigated",229.4,179.23,228.77,229.31,222.69,243.47,236.58,239.57,236.214,237.59479999999996,1.89,null,235.15333333333334,{"$f":"'Background Calculations'!$M$54","v":5.03},1182.8212666666668,1064.5391400000001,141.93855200000002,{"$f":"'Farm Bill Calculator'!$E$22","v":151.57666666666668},{"$f":"'Farm Bill Calculator'!$E$30","v":4.12},624.49586666666676,440.04327333333333,141.93855200000002]
[null,"MonroeCornNonirrigated","26045","Michigan","Monroe","","Corn","Bushel","Nonirrigated",202.6,180.64000000000001,193.01,153.22,209.54,178.36,209.41,191.69,190.31400000000002,197.73280000000003,1.87,null,193.15333333333334,{"$f":"'Background Calculations'!$M$54","v":5.03},971.56126666666671,874.40514000000007,116.587352,{"$f":"'Farm Bill Calculator'!$E$22","v":151.57666666666668},{"$f":"'Farm Bill Calculator'!$E$30","v":4.12},624.49586666666676,249.90927333333332,116.587352]
[null,"MontcalmCornIrrigated","26047","Michigan","Montcalm","","Corn","Bushel","Irrigated",195.12,201.03,187.87,199.99,204.63,208.49,200.76999999999998,223.04,209.09400000000002,210.91479999999999,1.71,null,204.63000000000002,{"$f":"'Background Calculations'!$M$54","v":5.03},1029.2889000000002,926.36001000000022,123.51466800000003,{"$f":"'Farm Bill Calculator'!$E$22","v":151.57666666666668},{"$f":"'Farm Bill Calculator'!$E$30","v":4.12},624.49586666666676,301.86414333333346,123.51466800000003]
[null,"MontcalmCornNonirrigated","26047","Michigan","Montcalm","","Corn","Bushel","Nonirrigated",141.79999999999998,138.97,131.82,136.68,170.96,160.72999999999999,159.57,182.09,163.47600000000003,168.83520000000001,1.47,null,163.75333333333336,{"$f":"'Background Calculations'!$M$54","v":5.03},823.67926666666688,741.3113400000002,98.841512000000023,{"$f":"'Farm Bill Calculator'!$E$22","v":151.57666666666668},{"$f":"'Farm Bill Calculator'!$E$30","v":4.12},624.49586666666676,116.81547333333344,98.841512000000023]
[null,"MontmorencyCornAll","26047","Michigan","Montmorency","","Corn","Bushel","All",150.02000000000001,89.149999999999991,125.38,148.25,173.67,130.98000000000002,143.29000000000002,138.68,148.70400000000001,148.79480000000001,1.73,null,143.40666666666672,{"$f":"'Background Calculations'!$M$54","v":5.03},721.33553333333361,649.20198000000028,86.560264000000032,{"$f":"'Farm Bill Calculator'!$E$22","v":151.57666666666668},{"$f":"'Farm Bill Calculator'!$E$30","v":4.12},624.49586666666676,24.706113333333519,24.706113333333519]
[null,"MuskegonCornIrrigated","26049","Michigan","Muskegon","","Corn","Bushel","Irrigated",174.42999999999998,140.75,128.69,167.42,209.64,196.81,204.44,195.79,196.12,201.86,1.3,null,199.01333333333332,{"$f":"'Background Calculations'!$M$54","v":5.03},1001.0370666666666,900.93335999999999,120.12444799999999,{"$f":"'Farm Bill Calculator'!$E$22","v":151.57666666666668},{"$f":"'Farm Bill Calculator'!$E$30","v":4.12},624.49586666666676,276.43749333333324,120.12444799999999]
[null,"MuskegonCornNonirrigated","26049","Michigan","Muskegon","","Corn","Bushel","Nonirrigated",146.47999999999999,130.71,116.01,156,188.15,180.05,170.97,171.07,174.518,178.22160000000002,1.27,null,174.03,{"$f":"'Background Calculations'!$M$54","v":5.03},875.37090000000001,787.83380999999997,105.04450799999999,{"$f":"'Farm Bill Calculator'!$E$22","v":151.57666666666668},{"$f":"'Farm Bill Calculator'!$E$30","v":4.12},624.49586666666676,163.33794333333321,105.04450799999999]
[null,"NewaygoCornIrrigated","26049","Michigan","Newaygo","","Corn","Bushel","Irrigated",191.67,181.20000000000002,161.32000000000002,186.04000000000002,196.10999999999999,192.88,162.04,220.12,192.34799999999998,193.60959999999997,0.91,null,191.67666666666665,{"$f":"'Background Calculations'!$M$54","v":5.03},964.13363333333325,867.72026999999991,115.69603599999999,{"$f":"'Farm Bill Calculator'!$E$22","v":151.57666666666668},{"$f":"'Farm Bill Calculator'!$E$30","v":4.12},624.49586666666676,243.22440333333316,115.69603599999999]
[null,"NewaygoCornNonirrigated","26051","Michigan","Newaygo","","Corn","Bushel","Nonirrigated",139.69,104.84,128.22,160.41,182.03,165.17999999999998,164.82,171.72,169.72200000000001,171.58439999999999,0.89,null,167.24000000000004,{"$f":"'Background Calculations'!$M$54","v":5.03},841.21720000000028,757.09548000000029,100.94606400000004,{"$f":"'Farm Bill Calculator'!$E$22","v":151.57666666666668},{"$f":"'Farm Bill Calculator'!$E$30","v":4.12},624.49586666666676,132.59961333333354,100.94606400000004]
[null,"OaklandCornAll","26051","Michigan","Oakland","","Corn","Bushel","All",153.26999999999998,127.55,131.71,138.32999999999998,179.16,125.4,123.66000000000001,151.69999999999999,145.14000000000001,146.50200000000001,1.49,null,138.47666666666669,{"$f":"'Background Calculations'!$M$54","v":5.03},696.53763333333347,626.88387000000012,83.584516000000008,{"$f":"'Farm Bill Calculator'!$E$22","v":151.57666666666668},{"$f":"'Farm Bill Calculator'!$E$30","v":4.12},624.49586666666676,2.3880033333333586,2.3880033333333586]
[null,"OceanaCornIrrigated","26051","Michigan","Oceana","","Corn","Bushel","Irrigated",173.51,150.03,150.01,181.12,190.44,164.05,157.13,188.27,178.322,177.76240000000001,2.12,null,177.81333333333336,{"$f":"'Background Calculations'!$M$54","v":5.03},894.40106666666691,804.96096000000023,107.32812800000002,{"$f":"'Farm Bill Calculator'!$E$22","v":151.57666666666668},{"$f":"'Farm Bill Calculator'!$E$30","v":4.12},624.49586666666676,180.46509333333347,107.32812800000002]
[null,"OceanaCornNonirrigated","26055","Michigan","Oceana","","Corn","Bushel","Nonirrigated",146.85,105.32,122.57,131.33000000000001,166.03,150.08000000000001,137.44,130.96,145.19800000000004,147.97160000000002,2.0299999999999998,null,139.6166666666667,{"$f":"'Background Calculations'!$M$54","v":5.03},702.27183333333357,632.04465000000027,84.272620000000032,{"$f":"'Farm Bill Calculator'!$E$22","v":151.57666666666668},{"$f":"'Farm Bill Calculator'!$E$30","v":4.12},624.49586666666676,7.5487833333335175,7.5487833333335175]
[null,"OgemawCornAll","26055","Michigan","Ogemaw","","Corn","Bushel","All",160.11999999999998,171.93,156.21,156.57,199.86999999999998,162.39000000000001,174.83,164.2,173.44199999999998,176.81639999999999,1.87,null,167.14,{"$f":"'Background Calculations'!$M$54","v":5.03},840.71420000000001,756.64278000000002,100.88570399999999,{"$f":"'Farm Bill Calculator'!$E$22","v":151.57666666666668},{"$f":"'Farm Bill Calculator'!$E$30","v":4.12},624.49586666666676,132.14691333333326,100.88570399999999]
[null,"OntonagonCornAll","26055","Michigan","Ontonagon","","Corn","Bushel","All",58.4,111,58.49,141.9,110.84,79.53,170.04,65.44,113.55,107.88,null,null,110.75666666666666,{"$f":"'Background Calculations'!$M$54","v":5.03},557.10603333333336,501.39543000000003,66.852723999999995,{"$f":"'Farm Bill Calculator'!$E$22","v":151.57666666666668},{"$f":"'Farm Bill Calculator'!$E$30","v":4.12},624.49586666666676,0,0]
[null,"OsceolaCornAll","26057","Michigan","Osceola","","Corn","Bushel","All",166.85,120.49,143.85999999999999,164.08,202.72,170.81,174.33,173.72,178.11199999999999,180.91839999999999,0.98,null,172.95333333333335,{"$f":"'Background Calculations'!$M$54","v":5.03},869.95526666666683,782.95974000000012,104.39463200000002,{"$f":"'Farm Bill Calculator'!$E$22","v":151.57666666666668},{"$f":"'Farm Bill Calculator'!$E$30","v":4.12},624.49586666666676,158.46387333333337,104.39463200000002]
[null,"OscodaCornAll","26057","Michigan","Oscoda","","Corn","Bushel","All",131,117,110.3,147.5,188.78,152.13999999999999,153.47,151.05000000000001,158.58800000000002,160.8056,null,null,152.22000000000003,{"$f":"'Background Calculations'!$M$54","v":5.03},765.66660000000013,689.09994000000017,91.879992000000016,{"$f":"'Farm Bill Calculator'!$E$22","v":151.57666666666668},{"$f":"'Farm Bill Calculator'!$E$30","v":4.12},624.49586666666676,64.604073333333417,64.604073333333417]
[null,"OtsegoCornAll","26057","Michigan","Otsego","","Corn","Bushel","All",140.49,100.88,137.47,155.4,148.51000000000002,83.89,152.02000000000001,130.19,135.702,131.76240000000001,1.7,null,143.57333333333335,{"$f":"'Background Calculations'!$M$54","v":5.03},722.17386666666675,649.95648000000006,86.660864000000004,{"$f":"'Farm Bill Calculator'!$E$22","v":151.57666666666668},{"$f":"'Farm Bill Calculator'!$E$30","v":4.12},624.49586666666676,25.460613333333299,25.460613333333299]
[null,"OttawaCornIrrigated","26057","Michigan","Ottawa","","Corn","Bushel","Irrigated",193.4,192.84,173.80999999999997,202.79,213.08,204.08,225.14,229.22,216.18199999999999,218.8604,1.32,null,214.1,{"$f":"'Background Calculations'!$M$54","v":5.03},1076.923,969.23070000000007,129.23076,{"$f":"'Farm Bill Calculator'!$E$22","v":151.57666666666668},{"$f":"'Farm Bill Calculator'!$E$30","v":4.12},624.49586666666676,344.73483333333331,129.23076]
[null,"OttawaCornNonirrigated","26057","Michigan","Ottawa","","Corn","Bushel","Nonirrigated",172.94,145.97999999999999,144.56,142.94999999999999,188.97,186.5,193.51000000000002,202.55,184.18600000000001,192.4332,1.29,null,189.66,{"$f":"'Background Calculations'!$M$54","v":5.03},953.98980000000006,858.59082000000012,114.478776,{"$f":"'Farm Bill Calculator'!$E$22","v":151.57666666666668},{"$f":"'Farm Bill Calculator'!$E$30","v":4.12},624.49586666666676,234.09495333333336,114.478776]
[null,"Presque IsleCornAll","26059","Michigan","Presque Isle","","Corn","Bushel","All",134.13,93.789999999999992,98.850000000000009,127.48,160.16000000000003,131.37,112.32000000000001,98.16,128.09799999999998,128.2216,2.2000000000000002,null,123.72333333333334,{"$f":"'Background Calculations'!$M$54","v":5.03},622.32836666666674,560.09553000000005,74.679404000000005,{"$f":"'Farm Bill Calculator'!$E$22","v":151.57666666666668},{"$f":"'Farm Bill Calculator'!$E$30","v":4.12},624.49586666666676,0,0]
[null,"RoscommonCornAll","26059","Michigan","Roscommon","","Corn","Bushel","All",131,117,127.65,132.87,188.78,156.28,171.84,171.34,164.22200000000001,170.4924,null,null,166.48666666666668,{"$f":"'Background Calculations'!$M$54","v":5.03},837.42793333333339,753.68514000000005,100.49135200000001,{"$f":"'Farm Bill Calculator'!$E$22","v":151.57666666666668},{"$f":"'Farm Bill Calculator'!$E$30","v":4.12},624.49586666666676,129.18927333333329,100.49135200000001]
[null,"SaginawCornAll","26059","Michigan","Saginaw","","Corn","Bushel","All",177.97000000000003,189.44,158.18,168.31,179.26,176.72000000000003,179.19,191.96,180.95800000000003,183.48760000000004,1.87,null,178.39000000000001,{"$f":"'Background Calculations'!$M$54","v":5.03},897.3017000000001,807.57153000000005,107.67620400000001,{"$f":"'Farm Bill Calculator'!$E$22","v":151.57666666666668},{"$f":"'Farm Bill Calculator'!$E$30","v":4.12},624.49586666666676,183.0756633333333,107.67620400000001]
[null,"SanilacCornAll","26059","Michigan","Sanilac","","Corn","Bushel","All",205.75,192.48,164.95999999999998,180.46,172.37,155.57,168.62,176.97,173.018,171.52959999999999,2.2200000000000002,null,172.65333333333334,{"$f":"'Background Calculations'!$M$54","v":5.03},868.4462666666667,781.60164000000009,104.21355200000001,{"$f":"'Farm Bill Calculator'!$E$22","v":151.57666666666668},{"$f":"'Farm Bill Calculator'!$E$30","v":4.12},624.49586666666676,157.10577333333333,104.21355200000001]
[null,"SchoolcraftCornAll","26059","Michigan","Schoolcraft","","Corn","Bushel","All",61.6,111,154,192.2,201.38,171.88,142.07999999999998,193.6,181.52800000000002,179.39359999999999,1.3,null,185.89333333333332,{"$f":"'Background Calculations'!$M$54","v":5.03},935.04346666666663,841.53912000000003,112.20521599999999,{"$f":"'Farm Bill Calculator'!$E$22","v":151.57666666666668},{"$f":"'Farm Bill Calculator'!$E$30","v":4.12},624.49586666666676,217.04325333333327,112.20521599999999]
[null,"ShiawasseeCornAll","26061","Michigan","Shiawassee","","Corn","Bushel","All",165.59,160.91999999999999,129.06,125.39999999999999,165.35000000000002,144.81,120.06,147.9,141.76400000000001,145.0368,1.06,null,139.37,{"$f":"'Background Calculations'!$M$54","v":5.03},701.03110000000004,630.92799000000002,84.123732000000004,{"$f":"'Farm Bill Calculator'!$E$22","v":151.57666666666668},{"$f":"'Farm Bill Calculator'!$E$30","v":4.12},624.49586666666676,6.4321233333332657,6.4321233333332657]
[null,"St. ClairCornAll","26063","Michigan","St. Clair","","Corn","Bushel","All",178.18,188.82,185.17000000000002,203.13000000000002,224.4,193.72,195.16,209.8,207.25200000000001,208.07639999999998,2.0099999999999998,null,202.69666666666669,{"$f":"'Background Calculations'!$M$54","v":5.03},1019.5642333333335,917.6078100000002,122.34770800000001,{"$f":"'Farm Bill Calculator'!$E$22","v":151.57666666666668},{"$f":"'Farm Bill Calculator'!$E$30","v":4.12},624.49586666666676,293.11194333333344,122.34770800000001]
[null,"St. JosephCornIrrigated","26063","Michigan","St. Joseph","","Corn","Bushel","Irrigated",151.1,150.25,61.6,182.9,110.84,79.53,170.04,65.44,121.75,109.51999999999998,null,null,120.13666666666666,{"$f":"'Background Calculations'!$M$54","v":5.03},604.2874333333333,543.85869000000002,72.51449199999999,{"$f":"'Farm Bill Calculator'!$E$22","v":151.57666666666668},{"$f":"'Farm Bill Calculator'!$E$30","v":4.12},624.49586666666676,0,0]
[null,"St. JosephCornNonirrigated","26063","Michigan","St. Joseph","","Corn","Bushel","Nonirrigated",107.72,158.6,162.42000000000002,179.33,179.94,165.59,176.43,200.75,182.18799999999999,182.75960000000001,1.78,null,178.56666666666663,{"$f":"'Background Calculations'!$M$54","v":5.03},898.19033333333323,808.37129999999991,107.78283999999998,{"$f":"'Farm Bill Calculator'!$E$22","v":151.57666666666668},{"$f":"'Farm Bill Calculator'!$E$30","v":4.12},624.49586666666676,183.87543333333315,107.78283999999998]
[null,"TuscolaCornIrrigated","26063","Michigan","Tuscola","","Corn","Bushel","Irrigated",193.22,218.46,190.57999999999998,202.62,229.88,199.82999999999998,205.39,205.76,210.65600000000001,212.26319999999998,1.96,null,204.59000000000003,{"$f":"'Background Calculations'!$M$54","v":5.03},1029.0877000000003,926.17893000000026,123.49052400000002,{"$f":"'Farm Bill Calculator'!$E$22","v":151.57666666666668},{"$f":"'Farm Bill Calculator'!$E$30","v":4.12},624.49586666666676,301.68306333333351,123.49052400000002]
[null,"TuscolaCornNonirrigated","26063","Michigan","Tuscola","","Corn","Bushel","Nonirrigated",182.25,180.55,176.07999999999998,183.61,214.48000000000002,184.29999999999998,190.16,199.15,196.28999999999996,198.82599999999996,1.95,null,191.20333333333329,{"$f":"'Background Calculations'!$M$54","v":5.03},961.7527666666665,865.5774899999999,115.41033199999998,{"$f":"'Farm Bill Calculator'!$E$22","v":151.57666666666668},{"$f":"'Farm Bill Calculator'!$E$30","v":4.12},624.49586666666676,241.08162333333314,115.41033199999998]
[null,"Van BurenCornIrrigated","26065","Michigan","Van Buren","","Corn","Bushel","Irrigated",213.5,215.55,202.23999999999998,200.98000000000002,196.25,211.44,225.41,217.93,212.36199999999999,214.63840000000002,1.96,null,210.11666666666667,{"$f":"'Background Calculations'!$M$54","v":5.03},1056.8868333333335,951.19815000000017,126.82642000000001,{"$f":"'Farm Bill Calculator'!$E$22","v":151.57666666666668},{"$f":"'Farm Bill Calculator'!$E$30","v":4.12},624.49586666666676,326.70228333333341,126.82642000000001]
[null,"Van BurenCornNonirrigated","26065","Michigan","Van Buren","","Corn","Bushel","Nonirrigated",166.57,149.55000000000001,132.13,134.12,154.70000000000002,153.53,170.07,166.99,157.66200000000001,162.37039999999999,1.78,null,158.40666666666669,{"$f":"'Background Calculations'!$M$54","v":5.03},796.78553333333355,717.10698000000025,95.61426400000002,{"$f":"'Farm Bill Calculator'!$E$22","v":151.57666666666668},{"$f":"'Farm Bill Calculator'!$E$30","v":4.12},624.49586666666676,92.611113333333492,92.611113333333492]
[null,"WashtenawCornIrrigated","26065","Michigan","Washtenaw","","Corn","Bushel","Irrigated",229.9,217.81,229.21,182.19,228.22,223.58,194.45,230.23,213.53400000000002,219.80280000000005,1.8,null,215.41666666666666,{"$f":"'Background Calculations'!$M$54","v":5.03},1083.5458333333333,975.19125000000008,130.02549999999999,{"$f":"'Farm Bill Calculator'!$E$22","v":151.57666666666668},{"$f":"'Farm Bill Calculator'!$E$30","v":4.12},624.49586666666676,350.69538333333333,130.02549999999999]
[null,"WashtenawCornNonirrigated","26065","Michigan","Washtenaw","","Corn","Bushel","Nonirrigated",158.84,140.28,161.17000000000002,155.05000000000001,181.94,156.9,176.58,181.78,172.20999999999998,175.642,1.76,null,171.75333333333333,{"$f":"'Background Calculations'!$M$54","v":5.03},863.91926666666666,777.52733999999998,103.670312,{"$f":"'Farm Bill Calculator'!$E$22","v":151.57666666666668},{"$f":"'Farm Bill Calculator'!$E$30","v":4.12},624.49586666666676,153.03147333333322,103.670312]
[null,"WayneCornAll","26067","Michigan","Wayne","","Corn","Bushel","All",144.68,123.07000000000001,135.58000000000001,98.76,116.77,89.190000000000012,151.43,154.38999999999999,123.038,127.89360000000001,0.93,null,122.31999999999998,{"$f":"'Background Calculations'!$M$54","v":5.03},615.26959999999997,553.74263999999994,73.832352,{"$f":"'Farm Bill Calculator'!$E$22","v":151.57666666666668},{"$f":"'Farm Bill Calculator'!$E$30","v":4.12},624.49586666666676,0,0]
[null,"WexfordCornIrrigated","26067","Michigan","Wexford","","Corn","Bushel","Irrigated",190.14,115.95,134.73999999999998,184.54999999999998,199.25,191.97,168.10999999999999,208.93,191.75199999999998,193.19239999999999,1.19,null,191.92333333333332,{"$f":"'Background Calculations'!$M$54","v":5.03},965.37436666666667,868.83693000000005,115.84492399999999,{"$f":"'Farm Bill Calculator'!$E$22","v":151.57666666666668},{"$f":"'Farm Bill Calculator'!$E$30","v":4.12},624.49586666666676,244.3410633333333,115.84492399999999]
[null,"WexfordCornNonirrigated","26067","Michigan","Wexford","","Corn","Bushel","Nonirrigated",163.41999999999999,158.94999999999999,127.11,128.65,162.91999999999999,162.41999999999999,145.66,159.62,153.04399999999998,157.9228,1.19,null,155.9,{"$f":"'Background Calculations'!$M$54","v":5.03},784.17700000000002,705.75930000000005,94.101240000000004,{"$f":"'Farm Bill Calculator'!$E$22","v":151.57666666666668},{"$f":"'Farm Bill Calculator'!$E$30","v":4.12},624.49586666666676,81.263433333333296,81.263433333333296]
[null,"AlconaSoybeansAll","26067","Michigan","Alcona","","Soybeans","Bushel","All",37,35.03,35.229999999999997,38.200000000000003,46.18,41.38,30.82,18.32,34.979999999999997,34.335999999999999,null,null,36.79999999999999,{"$f":"'Background Calculations'!$M$54","v":5.03},185.10399999999996,166.59359999999995,22.212479999999992,{"$f":"'Farm Bill Calculator'!$E$22","v":151.57666666666668},{"$f":"'Farm Bill Calculator'!$E$30","v":4.12},624.49586666666676,0,0]
[null,"AlleganSoybeansIrrigated","26067","Michigan","Allegan","","Soybeans","Bushel","Irrigated",59.69,64.929999999999993,64.320000000000007,66.56,59.49,63.53,62.58,63.68,63.728000000000009,63.161600000000007,0.56000000000000005,null,63.263333333333343,{"$f":"'Background Calculations'!$M$54","v":5.03},318.21456666666671,286.39311000000004,38.185748000000004,{"$f":"'Farm Bill Calculator'!$E$22","v":151.57666666666668},{"$f":"'Farm Bill Calculator'!$E$30","v":4.12},624.49586666666676,0,0]
[null,"AlleganSoybeansNonirrigated","26069","Michigan","Allegan","","Soybeans","Bushel","Nonirrigated",51.05,52.69,40.93,48.28,46.180000000000007,50.96,49.04,51.82,49.795999999999999,50.099199999999996,0.54,null,49.426666666666669,{"$f":"'Background Calculations'!$M$54","v":5.03},248.61613333333335,223.75452000000001,29.833936000000001,{"$f":"'Farm Bill Calculator'!$E$22","v":151.57666666666668},{"$f":"'Farm Bill Calculator'!$E$30","v":4.12},624.49586666666676,0,0]
[null,"AlpenaSoybeansAll","26069","Michigan","Alpena","","Soybeans","Bushel","All",35.729999999999997,38.35,27.540000000000003,47.45,47.3,37.340000000000003,38.17,36.86,41.694000000000003,40.542800000000007,0.27,null,40.93666666666666,{"$f":"'Background Calculations'!$M$54","v":5.03},205.91143333333332,185.32029,24.709371999999998,{"$f":"'Farm Bill Calculator'!$E$22","v":151.57666666666668},{"$f":"'Farm Bill Calculator'!$E$30","v":4.12},624.49586666666676,0,0]
[null,"AntrimSoybeansAll","26069","Michigan","Antrim","","Soybeans","Bushel","All",37,37,34.4,35.6,43.36,38.340000000000003,36.44,36.450000000000003,38.037999999999997,38.525599999999997,null,null,37.076666666666668,{"$f":"'Background Calculations'!$M$54","v":5.03},186.49563333333336,167.84607000000003,22.379476000000004,{"$f":"'Farm Bill Calculator'!$E$22","v":151.57666666666668},{"$f":"'Farm Bill Calculator'!$E$30","v":4.12},624.49586666666676,0,0]
[null,"ArenacSoybeansAll","26071","Michigan","Arenac","","Soybeans","Bushel","All",44.29,48.74,34.980000000000004,43.93,51.91,44.05,44.050000000000004,47.04,46.616,47.153199999999998,0.42,null,45.04666666666666,{"$f":"'Background Calculations'!$M$54","v":5.03},226.5847333333333,203.92625999999998,27.190167999999996,{"$f":"'Farm Bill Calculator'!$E$22","v":151.57666666666668},{"$f":"'Farm Bill Calculator'!$E$30","v":4.12},624.49586666666676,0,0]
[null,"BarrySoybeansIrrigated","26071","Michigan","Barry","","Soybeans","Bushel","Irrigated",59.42,62.29,48.980000000000004,59.78,59.82,59.699999999999996,60.910000000000004,62.74,61.069999999999993,61.327999999999996,0.48,null,60.169999999999995,{"$f":"'Background Calculations'!$M$54","v":5.03},302.6551,272.38959,36.318612000000002,{"$f":"'Farm Bill Calculator'!$E$22","v":151.57666666666668},{"$f":"'Farm Bill Calculator'!$E$30","v":4.12},624.49586666666676,0,0]
[null,"BarrySoybeansNonirrigated","26073","Michigan","Barry","","Soybeans","Bushel","Nonirrigated",46.52,49.12,49.98,45.96,51.410000000000004,52.029999999999994,43.839999999999996,48.52,48.822000000000003,49.394400000000005,0.47,null,48.63,{"$f":"'Background Calculations'!$M$54","v":5.03},244.60890000000003,220.14801000000003,29.353068000000004,{"$f":"'Farm Bill Calculator'!$E$22","v":151.57666666666668},{"$f":"'Farm Bill Calculator'!$E$30","v":4.12},624.49586666666676,0,0]
[null,"BaySoybeansIrrigated","26073","Michigan","Bay","","Soybeans","Bushel","Irrigated",42.9,54.67,52.99,63.940000000000005,59.81,64.06,51.39,57.67,59.944000000000003,59.144800000000004,0.56999999999999995,null,60.473333333333336,{"$f":"'Background Calculations'!$M$54","v":5.03},304.1808666666667,273.76278000000002,36.501704000000004,{"$f":"'Farm Bill Calculator'!$E$22","v":151.57666666666668},{"$f":"'Farm Bill Calculator'!$E$30","v":4.12},624.49586666666676,0,0]
[null,"BaySoybeansNonirrigated","26073","Michigan","Bay","","Soybeans","Bushel","Nonirrigated",50.9,60.199999999999996,40.730000000000004,53.77,58.03,51.33,52.65,55.13,54.752000000000002,54.948399999999999,0.56999999999999995,null,53.850000000000016,{"$f":"'Background Calculations'!$M$54","v":5.03},270.86550000000011,243.77895000000009,32.50386000000001,{"$f":"'Farm Bill Calculator'!$E$22","v":151.57666666666668},{"$f":"'Farm Bill Calculator'!$E$30","v":4.12},624.49586666666676,0,0]
[null,"BerrienSoybeansIrrigated","26073","Michigan","Berrien","","Soybeans","Bushel","Irrigated",57.86,68.77,56.58,67.149999999999991,63.870000000000005,58.53,57.93,53.97,60.75,59.470000000000006,0.46,null,60.109999999999992,{"$f":"'Background Calculations'!$M$54","v":5.03},302.35329999999999,272.11797000000001,36.282395999999999,{"$f":"'Farm Bill Calculator'!$E$22","v":151.57666666666668},{"$f":"'Farm Bill Calculator'!$E$30","v":4.12},624.49586666666676,0,0]
[null,"BerrienSoybeansNonirrigated","26073","Michigan","Berrien","","Soybeans","Bushel","Nonirrigated",43.949999999999996,53.629999999999995,41.72,45.190000000000005,52.62,45.78,46.35,38.93,46.213999999999999,46.418799999999997,0.44,null,45.773333333333333,{"$f":"'Background Calculations'!$M$54","v":5.03},230.23986666666667,207.21588,27.628784,{"$f":"'Farm Bill Calculator'!$E$22","v":151.57666666666668},{"$f":"'Farm Bill Calculator'!$E$30","v":4.12},624.49586666666676,0,0]
[null,"BranchSoybeansIrrigated","26075","Michigan","Branch","","Soybeans","Bushel","Irrigated",54.04,60.46,57.02,60.209999999999994,62.11,61.879999999999995,58.09,61.03,61.073999999999998,61.246799999999993,0.41,null,61.04,{"$f":"'Background Calculations'!$M$54","v":5.03},307.03120000000001,276.32808,36.843744000000001,{"$f":"'Farm Bill Calculator'!$E$22","v":151.57666666666668},{"$f":"'Farm Bill Calculator'!$E$30","v":4.12},624.49586666666676,0,0]
[null,"BranchSoybeansNonirrigated","26075","Michigan","Branch","","Soybeans","Bushel","Nonirrigated",41.84,48.410000000000004,45.680000000000007,47.02,51.75,53.52,40.74,45.3,48.056000000000012,48.263200000000005,0.39,null,48.023333333333341,{"$f":"'Background Calculations'!$M$54","v":5.03},241.55736666666672,217.40163000000007,28.986884000000007,{"$f":"'Farm Bill Calculator'!$E$22","v":151.57666666666668},{"$f":"'Farm Bill Calculator'!$E$30","v":4.12},624.49586666666676,0,0]
[null,"CalhounSoybeansIrrigated","26075","Michigan","Calhoun","","Soybeans","Bushel","Irrigated",55.36,65.31,52.269999999999996,60.050000000000004,61.410000000000004,61.550000000000004,53.76,55.99,58.942,58.720399999999998,0.39,null,59.15,{"$f":"'Background Calculations'!$M$54","v":5.03},297.52449999999999,267.77204999999998,35.702939999999998,{"$f":"'Farm Bill Calculator'!$E$22","v":151.57666666666668},{"$f":"'Farm Bill Calculator'!$E$30","v":4.12},624.49586666666676,0,0]
[null,"CalhounSoybeansNonirrigated","26075","Michigan","Calhoun","","Soybeans","Bushel","Nonirrigated",36,45.24,38.51,41.93,48.120000000000005,50,40.76,42.07,44.956000000000003,45.561200000000007,0.38,null,44.04,{"$f":"'Background Calculations'!$M$54","v":5.03},221.52119999999999,199.36908,26.582543999999999,{"$f":"'Farm Bill Calculator'!$E$22","v":151.57666666666668},{"$f":"'Farm Bill Calculator'!$E$30","v":4.12},624.49586666666676,0,0]
[null,{"$f":"E133&G133&I133","v":"CassSoybeansIrrigated"},"26075","Michigan","Cass","","Soybeans","Bushel","Irrigated",59.72,52.35,63.32,65.820000000000007,66.540000000000006,56.57,58.800000000000004,56.46,61.298000000000002,60.393599999999999,0.46,null,60.396666666666668,{"$f":"'Background Calculations'!$M$54","v":5.03},303.79523333333333,273.41570999999999,36.455427999999998,{"$f":"'Farm Bill Calculator'!$E$22","v":151.57666666666668},{"$f":"'Farm Bill Calculator'!$E$30","v":4.12},624.49586666666676,0,0]
[null,"CassSoybeansNonirrigated","26077","Michigan","Cass","","Soybeans","Bushel","Nonirrigated",44.03,51.2,44.019999999999996,41.370000000000005,49.56,41.82,42.93,37.15,{"$f":"AVERAGE(M134:Q134)+T134","v":42.956000000000003},{"$f":"AVERAGE(N134:R134)+T134","v":43.273200000000003},0.39,null,{"$f":"(SUM(M134:Q134)-MIN(M134:Q134)-MAX(M134:Q134))/(COUNT(M134:Q134)-2)","v":42.04},{"$f":"'Background Calculations'!$M$54","v":5.03},{"$f":"V134*W134","v":211.46120000000002},{"$f":"X134*0.9","v":190.31508000000002},{"$f":"X134*0.12","v":25.375344000000002},{"$f":"'Farm Bill Calculator'!$E$22","v":151.57666666666668},{"$f":"'Farm Bill Calculator'!$E$30","v":4.12},{"$f":"AB134*AA134","v":624.49586666666676},{"$f":"IF(Y134-AC134>0,Y134-AC134,0)","v":0},{"$f":"MIN(AD134,Z134)","v":0}]
[null,"CharlevoixSoybeansAll","26077","Michigan","Charlevoix","","Soybeans","Bushel","All",40.799999999999997,40.799999999999997,40.799999999999997,40.799999999999997,45.8,40.799999999999997,40.799999999999997,36.450000000000003,40.929999999999993,40.955999999999996,null,null,40.799999999999997,{"$f":"'Background Calculations'!$M$54","v":5.03},205.22399999999999,184.70159999999998,24.626879999999996,{"$f":"'Farm Bill Calculator'!$E$22","v":151.57666666666668},{"$f":"'Farm Bill Calculator'!$E$30","v":4.12},624.49586666666676,0,0]
[null,"CheboyganSoybeansAll","26077","Michigan","Cheboygan","","Soybeans","Bushel","All",40.799999999999997,40.799999999999997,40.799999999999997,40.799999999999997,42,40.799999999999997,40.799999999999997,36.450000000000003,40.169999999999995,40.043999999999997,null,null,40.79999999999999,{"$f":"'Background Calculations'!$M$54","v":5.03},205.22399999999996,184.70159999999996,24.626879999999993,{"$f":"'Farm Bill Calculator'!$E$22","v":151.57666666666668},{"$f":"'Farm Bill Calculator'!$E$30","v":4.12},624.49586666666676,0,0]
[null,"ChippewaSoybeansAll","26077","Michigan","Chippewa","","Soybeans","Bushel","All",37,37,1131.1099999999999,40.1,33.200000000000003,25.6,28.99,30.44,31.666000000000004,29.979200000000002,null,null,30.876666666666676,{"$f":"'Background Calculations'!$M$54","v":5.03},155.30963333333338,139.77867000000003,18.637156000000004,{"$f":"'Farm Bill Calculator'!$E$22","v":151.57666666666668},{"$f":"'Farm Bill Calculator'!$E$30","v":4.12},624.49586666666676,0,0]
[null,"ClareSoybeansAll","26077","Michigan","Clare","","Soybeans","Bushel","All",34.130000000000003,33.950000000000003,26.43,30.79,30.01,34.409999999999997,31.12,37.71,32.808,33.211599999999997,null,null,32.106666666666662,{"$f":"'Background Calculations'!$M$54","v":5.03},161.49653333333333,145.34688,19.379583999999998,{"$f":"'Farm Bill Calculator'!$E$22","v":151.57666666666668},{"$f":"'Farm Bill Calculator'!$E$30","v":4.12},624.49586666666676,0,0]
[null,"ClintonSoybeansIrrigated","26079","Michigan","Clinton","","Soybeans","Bushel","Irrigated",53.13,49.3,48.92,49.95,60.38,69,54.019999999999996,64.78,60.095999999999997,62.125199999999992,0.47,null,59.726666666666667,{"$f":"'Background Calculations'!$M$54","v":5.03},300.42513333333335,270.38262000000003,36.051015999999997,{"$f":"'Farm Bill Calculator'!$E$22","v":151.57666666666668},{"$f":"'Farm Bill Calculator'!$E$30","v":4.12},624.49586666666676,0,0]
[null,"ClintonSoybeansNonirrigated","26079","Michigan","Clinton","","Soybeans","Bushel","Nonirrigated",43.35,43.9,41.92,49.95,54.190000000000005,50.51,45.68,51.06,50.748000000000005,50.907599999999995,0.47,null,50.506666666666668,{"$f":"'Background Calculations'!$M$54","v":5.03},254.04853333333335,228.64368000000002,30.485824000000001,{"$f":"'Farm Bill Calculator'!$E$22","v":151.57666666666668},{"$f":"'Farm Bill Calculator'!$E$30","v":4.12},624.49586666666676,0,0]
[null,"DeltaSoybeansAll","26079","Michigan","Delta","","Soybeans","Bushel","All",37,37,34.4,40.1,33.200000000000003,17.600000000000001,28.99,30.44,30.066000000000003,28.059199999999997,null,null,30.876666666666676,{"$f":"'Background Calculations'!$M$54","v":5.03},155.30963333333338,139.77867000000003,18.637156000000004,{"$f":"'Farm Bill Calculator'!$E$22","v":151.57666666666668},{"$f":"'Farm Bill Calculator'!$E$30","v":4.12},624.49586666666676,0,0]
[null,"EatonSoybeansIrrigated","26081","Michigan","Eaton","","Soybeans","Bushel","Irrigated",54.37,64.69,49.04,55.36,56.22,49.629999999999995,46.519999999999996,59.87,54.01,53.74,0.49,null,53.736666666666657,{"$f":"'Background Calculations'!$M$54","v":5.03},270.29543333333328,243.26588999999996,32.435451999999991,{"$f":"'Farm Bill Calculator'!$E$22","v":151.57666666666668},{"$f":"'Farm Bill Calculator'!$E$30","v":4.12},624.49586666666676,0,0]
[null,"EatonSoybeansNonirrigated","26081","Michigan","Eaton","","Soybeans","Bushel","Nonirrigated",45.589999999999996,51.800000000000004,38.32,51.17,54.25,52.26,45.16,40.9,49.238000000000007,48.851599999999998,0.49,null,49.53,{"$f":"'Background Calculations'!$M$54","v":5.03},249.13590000000002,224.22231000000002,29.896308000000001,{"$f":"'Farm Bill Calculator'!$E$22","v":151.57666666666668},{"$f":"'Farm Bill Calculator'!$E$30","v":4.12},624.49586666666676,0,0]
[null,"EmmetSoybeansAll","26081","Michigan","Emmet","","Soybeans","Bushel","All",40.799999999999997,40.799999999999997,40.799999999999997,40.799999999999997,40.799999999999997,40.799999999999997,40.799999999999997,36.450000000000003,39.929999999999993,39.755999999999993,null,null,40.799999999999997,{"$f":"'Background Calculations'!$M$54","v":5.03},205.22399999999999,184.70159999999998,24.626879999999996,{"$f":"'Farm Bill Calculator'!$E$22","v":151.57666666666668},{"$f":"'Farm Bill Calculator'!$E$30","v":4.12},624.49586666666676,0,0]
[null,"GeneseeSoybeansAll","26081","Michigan","Genesee","","Soybeans","Bushel","All",42.769999999999996,49.5,39.39,46.79,49.35,41,43.010000000000005,43.61,45.101999999999997,44.764400000000009,0.35,null,44.47,{"$f":"'Background Calculations'!$M$54","v":5.03},223.6841,201.31569000000002,26.842091999999997,{"$f":"'Farm Bill Calculator'!$E$22","v":151.57666666666668},{"$f":"'Farm Bill Calculator'!$E$30","v":4.12},624.49586666666676,0,0]
[null,"GladwinSoybeansAll","26081","Michigan","Gladwin","","Soybeans","Bushel","All",41.26,43.16,34.4,42.72,48.47,37.830000000000005,37.69,42.8,42.302,42.218400000000003,0.4,null,41.116666666666667,{"$f":"'Background Calculations'!$M$54","v":5.03},206.81683333333334,186.13515000000001,24.818020000000001,{"$f":"'Farm Bill Calculator'!$E$22","v":151.57666666666668},{"$f":"'Farm Bill Calculator'!$E$30","v":4.12},624.49586666666676,0,0]
[null,"Grand TraverseSoybeansAll","26085","Michigan","Grand Traverse","","Soybeans","Bushel","All",34.869999999999997,27.75,34.4,35.9,40.92,34.79,41.13,36.61,37.86999999999999,38.263999999999996,null,null,37.809999999999995,{"$f":"'Background Calculations'!$M$54","v":5.03},190.18429999999998,171.16586999999998,22.822115999999998,{"$f":"'Farm Bill Calculator'!$E$22","v":151.57666666666668},{"$f":"'Farm Bill Calculator'!$E$30","v":4.12},624.49586666666676,0,0]
[null,"GratiotSoybeansIrrigated","26085","Michigan","Gratiot","","Soybeans","Bushel","Irrigated",51.49,57.440000000000005,48.76,52.1,56,55.68,49.79,57.07,54.648000000000003,55.157600000000002,0.52,null,54.593333333333334,{"$f":"'Background Calculations'!$M$54","v":5.03},274.60446666666667,247.14402000000001,32.952536000000002,{"$f":"'Farm Bill Calculator'!$E$22","v":151.57666666666668},{"$f":"'Farm Bill Calculator'!$E$30","v":4.12},624.49586666666676,0,0]
[null,"GratiotSoybeansNonirrigated","26087","Michigan","Gratiot","","Soybeans","Bushel","Nonirrigated",45.65,55.13,42.4,53.22,52.739999999999995,52.050000000000004,49.55,55.62,53.156000000000006,53.1432,0.52,null,52.669999999999995,{"$f":"'Background Calculations'!$M$54","v":5.03},264.93009999999998,238.43708999999998,31.791611999999997,{"$f":"'Farm Bill Calculator'!$E$22","v":151.57666666666668},{"$f":"'Farm Bill Calculator'!$E$30","v":4.12},624.49586666666676,0,0]
[null,"HillsdaleSoybeansIrrigated","26087","Michigan","Hillsdale","","Soybeans","Bushel","Irrigated",52.32,57.19,56.09,59.46,57.39,62.27,60.01,59.72,60.160000000000004,60.300000000000004,0.39,null,59.730000000000011,{"$f":"'Background Calculations'!$M$54","v":5.03},300.44190000000009,270.39771000000007,36.053028000000012,{"$f":"'Farm Bill Calculator'!$E$22","v":151.57666666666668},{"$f":"'Farm Bill Calculator'!$E$30","v":4.12},624.49586666666676,0,0]
[null,"HillsdaleSoybeansNonirrigated","26087","Michigan","Hillsdale","","Soybeans","Bushel","Nonirrigated",45.839999999999996,48.78,45.17,49.730000000000004,50.63,53.24,48.32,48.18,50.410000000000004,50.545999999999999,0.39,null,49.56,{"$f":"'Background Calculations'!$M$54","v":5.03},249.28680000000003,224.35812000000004,29.914416000000003,{"$f":"'Farm Bill Calculator'!$E$22","v":151.57666666666668},{"$f":"'Farm Bill Calculator'!$E$30","v":4.12},624.49586666666676,0,0]
[null,"HuronSoybeansIrrigated","26089","Michigan","Huron","","Soybeans","Bushel","Irrigated",50.92,59.550000000000004,47.82,62.25,56.77,60.19,63.57,66.97,62.52,62.573999999999998,0.56999999999999995,null,62.00333333333333,{"$f":"'Background Calculations'!$M$54","v":5.03},311.87676666666664,280.68908999999996,37.425211999999995,{"$f":"'Farm Bill Calculator'!$E$22","v":151.57666666666668},{"$f":"'Farm Bill Calculator'!$E$30","v":4.12},624.49586666666676,0,0]
[null,"HuronSoybeansNonirrigated","26089","Michigan","Huron","","Soybeans","Bushel","Nonirrigated",57.26,49.75,48.71,53.08,58.65,48.25,42.88,37.619999999999997,48.665999999999997,47.783200000000001,0.56999999999999995,null,48.069999999999993,{"$f":"'Background Calculations'!$M$54","v":5.03},241.79209999999998,217.61288999999999,29.015051999999997,{"$f":"'Farm Bill Calculator'!$E$22","v":151.57666666666668},{"$f":"'Farm Bill Calculator'!$E$30","v":4.12},624.49586666666676,0,0]
[null,"InghamSoybeansIrrigated","26089","Michigan","Ingham","","Soybeans","Bushel","Irrigated",42.39,50.16,49.22,50.9,60.949999999999996,57.38,55.949999999999996,62.59,58.073999999999998,59.508800000000008,0.52,null,58.093333333333327,{"$f":"'Background Calculations'!$M$54","v":5.03},292.20946666666663,262.98851999999999,35.065135999999995,{"$f":"'Farm Bill Calculator'!$E$22","v":151.57666666666668},{"$f":"'Farm Bill Calculator'!$E$30","v":4.12},624.49586666666676,0,0]
[null,"InghamSoybeansNonirrigated","26091","Michigan","Ingham","","Soybeans","Bushel","Nonirrigated",50.839999999999996,54.48,42.919999999999995,51.04,51.79,45.980000000000004,45.43,53.01,49.970000000000006,49.756000000000007,0.52,null,49.603333333333332,{"$f":"'Background Calculations'!$M$54","v":5.03},249.50476666666668,224.55429000000001,29.940572,{"$f":"'Farm Bill Calculator'!$E$22","v":151.57666666666668},{"$f":"'Farm Bill Calculator'!$E$30","v":4.12},624.49586666666676,0,0]
[null,"IoniaSoybeansIrrigated","26091","Michigan","Ionia","","Soybeans","Bushel","Irrigated",60.06,62.160000000000004,62.129999999999995,66.22,68.52,70.92,60.629999999999995,61.61,66.160000000000011,66.14800000000001,0.57999999999999996,null,65.45,{"$f":"'Background Calculations'!$M$54","v":5.03},329.21350000000001,296.29214999999999,39.50562,{"$f":"'Farm Bill Calculator'!$E$22","v":151.57666666666668},{"$f":"'Farm Bill Calculator'!$E$30","v":4.12},624.49586666666676,0,0]
[null,"IoniaSoybeansNonirrigated","26091","Michigan","Ionia","","Soybeans","Bushel","Nonirrigated",47.16,56.7,49.559999999999995,49.33,61.88,56.800000000000004,48.54,52.84,54.457999999999998,55.483600000000003,0.57999999999999996,null,52.99,{"$f":"'Background Calculations'!$M$54","v":5.03},266.53970000000004,239.88573000000005,31.984764000000002,{"$f":"'Farm Bill Calculator'!$E$22","v":151.57666666666668},{"$f":"'Farm Bill Calculator'!$E$30","v":4.12},624.49586666666676,0,0]
[null,"IoscoSoybeansAll","26091","Michigan","Iosco","","Soybeans","Bushel","All",38.94,47.72,33.520000000000003,33.82,42.07,38.43,40.300000000000004,39.11,39.166000000000004,40.235200000000006,0.42,null,39.280000000000008,{"$f":"'Background Calculations'!$M$54","v":5.03},197.57840000000004,177.82056000000006,23.709408000000003,{"$f":"'Farm Bill Calculator'!$E$22","v":151.57666666666668},{"$f":"'Farm Bill Calculator'!$E$30","v":4.12},624.49586666666676,0,0]
[null,"IsabellaSoybeansIrrigated","26091","Michigan","Isabella","","Soybeans","Bushel","Irrigated",48.11,50.27,45.14,53.220000000000006,55.88,47.35,40.269999999999996,37.880000000000003,47.410000000000004,46.247999999999998,0.49,null,46.94666666666668,{"$f":"'Background Calculations'!$M$54","v":5.03},236.14173333333341,212.52756000000008,28.337008000000008,{"$f":"'Farm Bill Calculator'!$E$22","v":151.57666666666668},{"$f":"'Farm Bill Calculator'!$E$30","v":4.12},624.49586666666676,0,0]
[null,"IsabellaSoybeansNonirrigated","26093","Michigan","Isabella","","Soybeans","Bushel","Nonirrigated",41.989999999999995,43.24,37.619999999999997,40.410000000000004,49.18,47.97,41.139999999999993,45.72,45.374000000000002,46.366799999999998,0.49,null,44.943333333333328,{"$f":"'Background Calculations'!$M$54","v":5.03},226.06496666666666,203.45847000000001,27.127796,{"$f":"'Farm Bill Calculator'!$E$22","v":151.57666666666668},{"$f":"'Farm Bill Calculator'!$E$30","v":4.12},624.49586666666676,0,0]
[null,"JacksonSoybeansIrrigated","26093","Michigan","Jackson","","Soybeans","Bushel","Irrigated",59.69,58.05,59.930000000000007,56.029999999999994,58.96,59.55,67.599999999999994,58.25,60.437999999999995,61.319600000000001,0.36,null,58.919999999999995,{"$f":"'Background Calculations'!$M$54","v":5.03},296.36759999999998,266.73084,35.564111999999994,{"$f":"'Farm Bill Calculator'!$E$22","v":151.57666666666668},{"$f":"'Farm Bill Calculator'!$E$30","v":4.12},624.49586666666676,0,0]
[null,"JacksonSoybeansNonirrigated","26093","Michigan","Jackson","","Soybeans","Bushel","Nonirrigated",35.21,43.35,44.59,40.74,49.269999999999996,47.83,44.580000000000005,46.87,46.207999999999998,47.301600000000001,0.35,null,46.426666666666655,{"$f":"'Background Calculations'!$M$54","v":5.03},233.52613333333329,210.17351999999997,28.023135999999994,{"$f":"'Farm Bill Calculator'!$E$22","v":151.57666666666668},{"$f":"'Farm Bill Calculator'!$E$30","v":4.12},624.49586666666676,0,0]
[null,"KalamazooSoybeansIrrigated","26095","Michigan","Kalamazoo","","Soybeans","Bushel","Irrigated",57.7,69.23,60.43,68.239999999999995,66.62,68.550000000000011,64.92,70.92,68.400000000000006,68.432000000000016,0.55000000000000004,null,67.803333333333342,{"$f":"'Background Calculations'!$M$54","v":5.03},341.05076666666673,306.94569000000007,40.926092000000004,{"$f":"'Farm Bill Calculator'!$E$22","v":151.57666666666668},{"$f":"'Farm Bill Calculator'!$E$30","v":4.12},624.49586666666676,0,0]
[null,"KalamazooSoybeansNonirrigated","26095","Michigan","Kalamazoo","","Soybeans","Bushel","Nonirrigated",39.309999999999995,48.22,43.55,39.270000000000003,51.330000000000005,48.83,42.11,47.84,46.346000000000004,47.761199999999995,0.47,null,46.26,{"$f":"'Background Calculations'!$M$54","v":5.03},232.68780000000001,209.41902000000002,27.922536000000001,{"$f":"'Farm Bill Calculator'!$E$22","v":151.57666666666668},{"$f":"'Farm Bill Calculator'!$E$30","v":4.12},624.49586666666676,0,0]
[null,"KalkaskaSoybeansAll","26095","Michigan","Kalkaska","","Soybeans","Bushel","All",37,37,34.4,35.200000000000003,43.36,38.340000000000003,36.44,36.450000000000003,37.958000000000006,38.509599999999999,null,null,37.076666666666675,{"$f":"'Background Calculations'!$M$54","v":5.03},186.49563333333339,167.84607000000005,22.379476000000004,{"$f":"'Farm Bill Calculator'!$E$22","v":151.57666666666668},{"$f":"'Farm Bill Calculator'!$E$30","v":4.12},624.49586666666676,0,0]
[null,"KentSoybeansIrrigated","26097","Michigan","Kent","","Soybeans","Bushel","Irrigated",48.54,66.62,48.68,61.28,61.52,67.239999999999995,57.339999999999996,54.07,60.870000000000005,60.78799999999999,0.57999999999999996,null,60.046666666666681,{"$f":"'Background Calculations'!$M$54","v":5.03},302.03473333333341,271.8312600000001,36.244168000000009,{"$f":"'Farm Bill Calculator'!$E$22","v":151.57666666666668},{"$f":"'Farm Bill Calculator'!$E$30","v":4.12},624.49586666666676,0,0]
[null,"KentSoybeansNonirrigated","26097","Michigan","Kent","","Soybeans","Bushel","Nonirrigated",43.61,46.720000000000006,46.32,48.75,54.29,52.02,45.79,46.89,50.118000000000002,50.391600000000004,0.56999999999999995,null,49.220000000000006,{"$f":"'Background Calculations'!$M$54","v":5.03},247.57660000000004,222.81894000000005,29.709192000000005,{"$f":"'Farm Bill Calculator'!$E$22","v":151.57666666666668},{"$f":"'Farm Bill Calculator'!$E$30","v":4.12},624.49586666666676,0,0]
[null,"LapeerSoybeansAll","26097","Michigan","Lapeer","","Soybeans","Bushel","All",42.699999999999996,47.669999999999995,36.839999999999996,50.55,48.62,41.29,40.5,45.29,45.679999999999993,44.705999999999996,0.43,null,45.066666666666663,{"$f":"'Background Calculations'!$M$54","v":5.03},226.68533333333332,204.01679999999999,27.202239999999996,{"$f":"'Farm Bill Calculator'!$E$22","v":151.57666666666668},{"$f":"'Farm Bill Calculator'!$E$30","v":4.12},624.49586666666676,0,0]
[null,"LeelanauSoybeansAll","26099","Michigan","Leelanau","","Soybeans","Bushel","All",45.13,40.799999999999997,40.799999999999997,40.799999999999997,40.92,40.799999999999997,40.799999999999997,36.450000000000003,39.953999999999994,39.784799999999997,null,null,40.799999999999997,{"$f":"'Background Calculations'!$M$54","v":5.03},205.22399999999999,184.70159999999998,24.626879999999996,{"$f":"'Farm Bill Calculator'!$E$22","v":151.57666666666668},{"$f":"'Farm Bill Calculator'!$E$30","v":4.12},624.49586666666676,0,0]
[null,"LenaweeSoybeansIrrigated","26099","Michigan","Lenawee","","Soybeans","Bushel","Irrigated",58.120000000000005,62,69.570000000000007,74.050000000000011,67.210000000000008,73.290000000000006,65.2,62.28,68.935999999999993,67.913200000000003,0.53,null,68.566666666666663,{"$f":"'Background Calculations'!$M$54","v":5.03},344.89033333333333,310.40129999999999,41.386839999999999,{"$f":"'Farm Bill Calculator'!$E$22","v":151.57666666666668},{"$f":"'Farm Bill Calculator'!$E$30","v":4.12},624.49586666666676,0,0]
[null,"LenaweeSoybeansNonirrigated","26099","Michigan","Lenawee","","Soybeans","Bushel","Nonirrigated",51.910000000000004,54.220000000000006,52.94,51.339999999999996,55.72,53.830000000000005,57.43,49.91,54.176000000000002,54.743200000000009,0.53,null,53.63,{"$f":"'Background Calculations'!$M$54","v":5.03},269.75890000000004,242.78301000000005,32.371068000000001,{"$f":"'Farm Bill Calculator'!$E$22","v":151.57666666666668},{"$f":"'Farm Bill Calculator'!$E$30","v":4.12},624.49586666666676,0,0]
[null,"LivingstonSoybeansAll","26101","Michigan","Livingston","","Soybeans","Bushel","All",41.61,48.330000000000005,47.93,47.879999999999995,51.870000000000005,48.010000000000005,48.54,55.08,50.735999999999997,51.307200000000002,0.46,null,49.473333333333336,{"$f":"'Background Calculations'!$M$54","v":5.03},248.85086666666669,223.96578000000002,29.862104000000002,{"$f":"'Farm Bill Calculator'!$E$22","v":151.57666666666668},{"$f":"'Farm Bill Calculator'!$E$30","v":4.12},624.49586666666676,0,0]
[null,"LuceSoybeansAll","26101","Michigan","Luce","","Soybeans","Bushel","All",37,37,34.4,40.1,33.200000000000003,26.4,28.99,30.44,31.826000000000004,30.171199999999999,null,null,30.876666666666676,{"$f":"'Background Calculations'!$M$54","v":5.03},155.30963333333338,139.77867000000003,18.637156000000004,{"$f":"'Farm Bill Calculator'!$E$22","v":151.57666666666668},{"$f":"'Farm Bill Calculator'!$E$30","v":4.12},624.49586666666676,0,0]
[null,"MackinacSoybeansAll","26101","Michigan","Mackinac","","Soybeans","Bushel","All",37,37,34.4,40.1,33.200000000000003,28.8,28.99,30.44,32.305999999999997,30.747199999999999,null,null,30.876666666666665,{"$f":"'Background Calculations'!$M$54","v":5.03},155.30963333333332,139.77867000000001,18.637155999999997,{"$f":"'Farm Bill Calculator'!$E$22","v":151.57666666666668},{"$f":"'Farm Bill Calculator'!$E$30","v":4.12},624.49586666666676,0,0]
[null,"MacombSoybeansAll","26103","Michigan","Macomb","","Soybeans","Bushel","All",43.96,47.559999999999995,38.31,43.01,42.339999999999996,37.5,40.110000000000007,36.72,40.356000000000002,39.825200000000002,0.42,null,39.983333333333341,{"$f":"'Background Calculations'!$M$54","v":5.03},201.11616666666671,181.00455000000005,24.133940000000006,{"$f":"'Farm Bill Calculator'!$E$22","v":151.57666666666668},{"$f":"'Farm Bill Calculator'!$E$30","v":4.12},624.49586666666676,0,0]
[null,"ManisteeSoybeansAll","26103","Michigan","Manistee","","Soybeans","Bushel","All",37,36.700000000000003,34.4,37.6,48.45,38.340000000000003,36.44,36.450000000000003,39.456000000000003,39.827200000000005,null,null,37.463333333333345,{"$f":"'Background Calculations'!$M$54","v":5.03},188.44056666666674,169.59651000000008,22.61286800000001,{"$f":"'Farm Bill Calculator'!$E$22","v":151.57666666666668},{"$f":"'Farm Bill Calculator'!$E$30","v":4.12},624.49586666666676,0,0]
[null,"MasonSoybeansAll","26105","Michigan","Mason","","Soybeans","Bushel","All",49.45,47.559999999999995,44.29,49.77,58.05,45.830000000000005,39.199999999999996,40.44,47.178000000000004,46.659599999999998,0.52,null,45.346666666666671,{"$f":"'Background Calculations'!$M$54","v":5.03},228.09373333333338,205.28436000000005,27.371248000000005,{"$f":"'Farm Bill Calculator'!$E$22","v":151.57666666666668},{"$f":"'Farm Bill Calculator'!$E$30","v":4.12},624.49586666666676,0,0]
[null,"MecostaSoybeansIrrigated","26105","Michigan","Mecosta","","Soybeans","Bushel","Irrigated",55.54,54.02,34.4,56.39,59.08,55.02,43.84,48.55,52.576000000000001,51.813200000000009,null,null,53.319999999999993,{"$f":"'Background Calculations'!$M$54","v":5.03},268.19959999999998,241.37963999999999,32.183951999999998,{"$f":"'Farm Bill Calculator'!$E$22","v":151.57666666666668},{"$f":"'Farm Bill Calculator'!$E$30","v":4.12},624.49586666666676,0,0]
[null,"MecostaSoybeansNonirrigated","26105","Michigan","Mecosta","","Soybeans","Bushel","Nonirrigated",33.32,26.47,23.2,30.08,36.42,27.81,35.409999999999997,35.909999999999997,33.125999999999998,33.735200000000006,null,null,33.799999999999997,{"$f":"'Background Calculations'!$M$54","v":5.03},170.01399999999998,153.01259999999999,20.401679999999995,{"$f":"'Farm Bill Calculator'!$E$22","v":151.57666666666668},{"$f":"'Farm Bill Calculator'!$E$30","v":4.12},624.49586666666676,0,0]
[null,"MenomineeSoybeansAll","26105","Michigan","Menominee","","Soybeans","Bushel","All",24.18,37.72,17.600000000000001,38.25,33.200000000000003,21.61,28.99,30.44,30.498000000000001,28.947600000000001,null,null,30.876666666666665,{"$f":"'Background Calculations'!$M$54","v":5.03},155.30963333333332,139.77867000000001,18.637155999999997,{"$f":"'Farm Bill Calculator'!$E$22","v":151.57666666666668},{"$f":"'Farm Bill Calculator'!$E$30","v":4.12},624.49586666666676,0,0]
[null,"MidlandSoybeansAll","26107","Michigan","Midland","","Soybeans","Bushel","All",43.050000000000004,47.48,40.58,46.02,50.39,48,44.419999999999995,48.09,47.874000000000002,48.244800000000005,0.49,null,47.370000000000005,{"$f":"'Background Calculations'!$M$54","v":5.03},238.27110000000005,214.44399000000004,28.592532000000006,{"$f":"'Farm Bill Calculator'!$E$22","v":151.57666666666668},{"$f":"'Farm Bill Calculator'!$E$30","v":4.12},624.49586666666676,0,0]
[null,"MissaukeeSoybeansAll","26107","Michigan","Missaukee","","Soybeans","Bushel","All",37,37,34.4,35.4,35.47,38.340000000000003,36.44,36.450000000000003,36.42,36.624000000000002,null,null,36.120000000000005,{"$f":"'Background Calculations'!$M$54","v":5.03},181.68360000000004,163.51524000000003,21.802032000000004,{"$f":"'Farm Bill Calculator'!$E$22","v":151.57666666666668},{"$f":"'Farm Bill Calculator'!$E$30","v":4.12},624.49586666666676,0,0]
[null,"MonroeSoybeansAll","26107","Michigan","Monroe","","Soybeans","Bushel","All",52.41,49.28,51.91,45.46,54.56,45.04,53.599999999999994,47.46,49.714000000000006,50.564799999999998,0.49,null,48.84,{"$f":"'Background Calculations'!$M$54","v":5.03},245.66520000000003,221.09868000000003,29.479824000000001,{"$f":"'Farm Bill Calculator'!$E$22","v":151.57666666666668},{"$f":"'Farm Bill Calculator'!$E$30","v":4.12},624.49586666666676,0,0]
[null,"MontcalmSoybeansIrrigated","26107","Michigan","Montcalm","","Soybeans","Bushel","Irrigated",52.47,56.13,53.68,57.7,61.09,58.660000000000004,51.779999999999994,56.2,57.485999999999997,57.443199999999997,0.4,null,57.52,{"$f":"'Background Calculations'!$M$54","v":5.03},289.32560000000001,260.39304000000004,34.719071999999997,{"$f":"'Farm Bill Calculator'!$E$22","v":151.57666666666668},{"$f":"'Farm Bill Calculator'!$E$30","v":4.12},624.49586666666676,0,0]
[null,"MontcalmSoybeansNonirrigated","26107","Michigan","Montcalm","","Soybeans","Bushel","Nonirrigated",35.6,42.089999999999996,37.61,45.94,48.260000000000005,45.05,40.65,45.6,45.480000000000004,45.388000000000005,0.38,null,45.529999999999994,{"$f":"'Background Calculations'!$M$54","v":5.03},229.01589999999999,206.11430999999999,27.481907999999997,{"$f":"'Farm Bill Calculator'!$E$22","v":151.57666666666668},{"$f":"'Farm Bill Calculator'!$E$30","v":4.12},624.49586666666676,0,0]
[null,"MontmorencySoybeansAll","26109","Michigan","Montmorency","","Soybeans","Bushel","All",41.79,37,30.57,44.9,48.29,39.71,31.94,38.94,40.756,39.927199999999999,null,null,41.183333333333337,{"$f":"'Background Calculations'!$M$54","v":5.03},207.15216666666669,186.43695000000002,24.858260000000001,{"$f":"'Farm Bill Calculator'!$E$22","v":151.57666666666668},{"$f":"'Farm Bill Calculator'!$E$30","v":4.12},624.49586666666676,0,0]
[null,"MuskegonSoybeansAll","26109","Michigan","Muskegon","","Soybeans","Bushel","All",48.71,47.400000000000006,31.34,42.75,54.71,54.02,43.150000000000006,51.9,49.816000000000003,51.229199999999999,0.51,null,49.690000000000005,{"$f":"'Background Calculations'!$M$54","v":5.03},249.94070000000005,224.94663000000006,29.992884000000004,{"$f":"'Farm Bill Calculator'!$E$22","v":151.57666666666668},{"$f":"'Farm Bill Calculator'!$E$30","v":4.12},624.49586666666676,0,0]
[null,"NewaygoSoybeansAll","26109","Michigan","Newaygo","","Soybeans","Bushel","All",36.19,35.369999999999997,43.480000000000004,41.839999999999996,53.83,53.53,47.550000000000004,49.77,49.783999999999999,51.372799999999998,0.48,null,50.283333333333339,{"$f":"'Background Calculations'!$M$54","v":5.03},252.92516666666671,227.63265000000004,30.351020000000005,{"$f":"'Farm Bill Calculator'!$E$22","v":151.57666666666668},{"$f":"'Farm Bill Calculator'!$E$30","v":4.12},624.49586666666676,0,0]
[null,"OaklandSoybeansAll","26111","Michigan","Oakland","","Soybeans","Bushel","All",34.370000000000005,32.17,33.03,34.76,41.11,28.99,31.21,31.24,33.792000000000002,33.598399999999998,0.33,null,32.403333333333329,{"$f":"'Background Calculations'!$M$54","v":5.03},162.98876666666666,146.68988999999999,19.558651999999999,{"$f":"'Farm Bill Calculator'!$E$22","v":151.57666666666668},{"$f":"'Farm Bill Calculator'!$E$30","v":4.12},624.49586666666676,0,0]
[null,"OceanaSoybeansIrrigated","26111","Michigan","Oceana","","Soybeans","Bushel","Irrigated",48.46,36.369999999999997,42.879999999999995,55.05,49.48,48.67,43.92,46.21,49.096000000000004,47.905200000000001,0.43,null,48.120000000000005,{"$f":"'Background Calculations'!$M$54","v":5.03},242.04360000000003,217.83924000000002,29.045232000000002,{"$f":"'Farm Bill Calculator'!$E$22","v":151.57666666666668},{"$f":"'Farm Bill Calculator'!$E$30","v":4.12},624.49586666666676,0,0]
[null,"OceanaSoybeansNonirrigated","26111","Michigan","Oceana","","Soybeans","Bushel","Nonirrigated",40.549999999999997,33.480000000000004,29.72,40,44.88,39.76,35.650000000000006,36.42,39.762,39.714400000000005,0.42,null,38.726666666666659,{"$f":"'Background Calculations'!$M$54","v":5.03},194.7951333333333,175.31561999999997,23.375415999999994,{"$f":"'Farm Bill Calculator'!$E$22","v":151.57666666666668},{"$f":"'Farm Bill Calculator'!$E$30","v":4.12},624.49586666666676,0,0]
[null,"OgemawSoybeansAll","26111","Michigan","Ogemaw","","Soybeans","Bushel","All",43.66,40.06,35,33.25,46.87,38.96,43.28,41.78,40.828000000000003,42.343600000000002,null,null,41.34,{"$f":"'Background Calculations'!$M$54","v":5.03},207.94020000000003,187.14618000000004,24.952824000000003,{"$f":"'Farm Bill Calculator'!$E$22","v":151.57666666666668},{"$f":"'Farm Bill Calculator'!$E$30","v":4.12},624.49586666666676,0,0]
[null,"OsceolaSoybeansAll","26113","Michigan","Osceola","","Soybeans","Bushel","All",33.47,29.81,24,32.92,42.86,27.56,36.44,40.11,35.977999999999994,36.589599999999997,null,null,36.489999999999995,{"$f":"'Background Calculations'!$M$54","v":5.03},183.54469999999998,165.19022999999999,22.025363999999996,{"$f":"'Farm Bill Calculator'!$E$22","v":151.57666666666668},{"$f":"'Farm Bill Calculator'!$E$30","v":4.12},624.49586666666676,0,0]
[null,"OtsegoSoybeansAll","26113","Michigan","Otsego","","Soybeans","Bushel","All",27.5,37,33.020000000000003,44.9,45.8,38.340000000000003,25.18,36.450000000000003,38.134,36.780799999999999,null,null,39.896666666666668,{"$f":"'Background Calculations'!$M$54","v":5.03},200.68023333333335,180.61221,24.081628000000002,{"$f":"'Farm Bill Calculator'!$E$22","v":151.57666666666668},{"$f":"'Farm Bill Calculator'!$E$30","v":4.12},624.49586666666676,0,0]
[null,"OttawaSoybeansIrrigated","26113","Michigan","Ottawa","","Soybeans","Bushel","Irrigated",53.599999999999994,50.82,57.010000000000005,47.51,57.45,60.01,52.68,57.32,55.564000000000007,57.174799999999998,0.56999999999999995,null,55.816666666666684,{"$f":"'Background Calculations'!$M$54","v":5.03},280.75783333333345,252.68205000000012,33.690940000000012,{"$f":"'Farm Bill Calculator'!$E$22","v":151.57666666666668},{"$f":"'Farm Bill Calculator'!$E$30","v":4.12},624.49586666666676,0,0]
[null,"OttawaSoybeansNonirrigated","26113","Michigan","Ottawa","","Soybeans","Bushel","Nonirrigated",49.66,46.23,44.58,46.76,52.26,56.2,49.43,55.03,52.506,53.655200000000008,0.56999999999999995,null,52.240000000000009,{"$f":"'Background Calculations'!$M$54","v":5.03},262.76720000000006,236.49048000000005,31.532064000000005,{"$f":"'Farm Bill Calculator'!$E$22","v":151.57666666666668},{"$f":"'Farm Bill Calculator'!$E$30","v":4.12},624.49586666666676,0,0]
[null,{"$f":"E197&G197&I197","v":"Presque IsleSoybeansAll"},"26115","Michigan","Presque Isle","","Soybeans","Bushel","All",37,20.8,20.8,43.92,31.92,24.33,30,17.73,29.580000000000002,26.712,null,null,28.750000000000004,{"$f":"'Background Calculations'!$M$54","v":5.03},144.61250000000001,130.15125,17.3535,{"$f":"'Farm Bill Calculator'!$E$22","v":151.57666666666668},{"$f":"'Farm Bill Calculator'!$E$30","v":4.12},624.49586666666676,0,0]
[null,"SaginawSoybeansIrrigated","26115","Michigan","Saginaw","","Soybeans","Bushel","Irrigated",57.010000000000005,68.36,45,64.25,59.05,64.56,54.31,59.85,{"$f":"AVERAGE(M198:Q198)+T198","v":60.904000000000011},{"$f":"AVERAGE(N198:R198)+T198","v":60.234800000000007},0.5,null,{"$f":"(SUM(M198:Q198)-MIN(M198:Q198)-MAX(M198:Q198))/(COUNT(M198:Q198)-2)","v":61.050000000000011},{"$f":"'Background Calculations'!$M$54","v":5.03},{"$f":"V198*W198","v":307.08150000000006},{"$f":"X198*0.9","v":276.37335000000007},{"$f":"X198*0.12","v":36.849780000000003},{"$f":"'Farm Bill Calculator'!$E$22","v":151.57666666666668},{"$f":"'Farm Bill Calculator'!$E$30","v":4.12},{"$f":"AB198*AA198","v":624.49586666666676},{"$f":"IF(Y198-AC198>0,Y198-AC198,0)","v":0},{"$f":"MIN(AD198,Z198)","v":0}]
[null,"SaginawSoybeansNonirrigated","26115","Michigan","Saginaw","","Soybeans","Bushel","Nonirrigated",47.49,55.629999999999995,42.82,52.58,51.54,51.69,47.55,50.76,51.323999999999998,51.072799999999994,0.5,null,51.330000000000005,{"$f":"'Background Calculations'!$M$54","v":5.03},258.18990000000002,232.37091000000004,30.982788000000003,{"$f":"'Farm Bill Calculator'!$E$22","v":151.57666666666668},{"$f":"'Farm Bill Calculator'!$E$30","v":4.12},624.49586666666676,0,0]
[null,"SanilacSoybeansAll","26115","Michigan","Sanilac","","Soybeans","Bushel","All",50.31,56.349999999999994,34.730000000000004,49.55,40.07,36.6,37.409999999999997,41.41,41.387999999999998,39.755600000000008,0.38,null,39.630000000000003,{"$f":"'Background Calculations'!$M$54","v":5.03},199.33890000000002,179.40501000000003,23.920668000000003,{"$f":"'Farm Bill Calculator'!$E$22","v":151.57666666666668},{"$f":"'Farm Bill Calculator'!$E$30","v":4.12},624.49586666666676,0,0]
[null,"ShiawasseeSoybeansIrrigated","26117","Michigan","Shiawassee","","Soybeans","Bushel","Irrigated",40.340000000000003,52.230000000000004,49.1,56.96,61.27,58.04,57.71,56.3,58.556000000000004,58.875199999999992,0.5,null,57.57,{"$f":"'Background Calculations'!$M$54","v":5.03},289.57710000000003,260.61939000000001,34.749252000000006,{"$f":"'Farm Bill Calculator'!$E$22","v":151.57666666666668},{"$f":"'Farm Bill Calculator'!$E$30","v":4.12},624.49586666666676,0,0]
[null,"ShiawasseeSoybeansNonirrigated","26117","Michigan","Shiawassee","","Soybeans","Bushel","Nonirrigated",42.480000000000004,49.86,43.239999999999995,33.96,43.660000000000004,44.71,35.11,39.92,39.862000000000002,41.042400000000001,0.39,null,39.563333333333333,{"$f":"'Background Calculations'!$M$54","v":5.03},199.00356666666667,179.10321000000002,23.880427999999998,{"$f":"'Farm Bill Calculator'!$E$22","v":151.57666666666668},{"$f":"'Farm Bill Calculator'!$E$30","v":4.12},624.49586666666676,0,0]
[null,"St. ClairSoybeansAll","26117","Michigan","St. Clair","","Soybeans","Bushel","All",40.92,48.099999999999994,43.23,57.31,56.34,49.87,47.33,52.83,53.236000000000004,52.421199999999999,0.5,null,53.013333333333343,{"$f":"'Background Calculations'!$M$54","v":5.03},266.65706666666671,239.99136000000004,31.998848000000002,{"$f":"'Farm Bill Calculator'!$E$22","v":151.57666666666668},{"$f":"'Farm Bill Calculator'!$E$30","v":4.12},624.49586666666676,0,0]
[null,"St. JosephSoybeansIrrigated","26117","Michigan","St. Joseph","","Soybeans","Bushel","Irrigated",51.44,55.6,43.36,50.519999999999996,60.29,54.709999999999994,53.98,58.39,55.987999999999992,57.081599999999995,0.41,null,55.693333333333335,{"$f":"'Background Calculations'!$M$54","v":5.03},280.13746666666668,252.12372000000002,33.616495999999998,{"$f":"'Farm Bill Calculator'!$E$22","v":151.57666666666668},{"$f":"'Farm Bill Calculator'!$E$30","v":4.12},624.49586666666676,0,0]
[null,"St. JosephSoybeansNonirrigated","26117","Michigan","St. Joseph","","Soybeans","Bushel","Nonirrigated",33.65,49.3,37.36,53.699999999999996,53.97,43.79,45.82,46.02,49.069999999999993,48.143999999999991,0.41,null,48.513333333333328,{"$f":"'Background Calculations'!$M$54","v":5.03},244.02206666666666,219.61985999999999,29.282647999999998,{"$f":"'Farm Bill Calculator'!$E$22","v":151.57666666666668},{"$f":"'Farm Bill Calculator'!$E$30","v":4.12},624.49586666666676,0,0]
[null,"TuscolaSoybeansIrrigated","26117","Michigan","Tuscola","","Soybeans","Bushel","Irrigated",44.12,66.53,58.55,56.59,60.31,55.129999999999995,49.6,61.39,57.153999999999996,57.266799999999996,0.55000000000000004,null,57.343333333333327,{"$f":"'Background Calculations'!$M$54","v":5.03},288.43696666666665,259.59327000000002,34.612435999999995,{"$f":"'Farm Bill Calculator'!$E$22","v":151.57666666666668},{"$f":"'Farm Bill Calculator'!$E$30","v":4.12},624.49586666666676,0,0]
[null,"TuscolaSoybeansNonirrigated","26119","Michigan","Tuscola","","Soybeans","Bushel","Nonirrigated",48.489999999999995,58,44.94,53.31,58.28,51.76,52.78,52.86,54.347999999999999,54.555599999999998,0.55000000000000004,null,52.983333333333341,{"$f":"'Background Calculations'!$M$54","v":5.03},266.50616666666673,239.85555000000005,31.980740000000008,{"$f":"'Farm Bill Calculator'!$E$22","v":151.57666666666668},{"$f":"'Farm Bill Calculator'!$E$30","v":4.12},624.49586666666676,0,0]
[null,"Van BurenSoybeansIrrigated","26119","Michigan","Van Buren","","Soybeans","Bushel","Irrigated",53.28,62.879999999999995,55.18,61.78,62.4,58.74,56.13,56.9,59.629999999999995,59.2,0.44,null,59.139999999999993,{"$f":"'Background Calculations'!$M$54","v":5.03},297.4742,267.72678000000002,35.696903999999996,{"$f":"'Farm Bill Calculator'!$E$22","v":151.57666666666668},{"$f":"'Farm Bill Calculator'!$E$30","v":4.12},624.49586666666676,0,0]
[null,"Van BurenSoybeansNonirrigated","26119","Michigan","Van Buren","","Soybeans","Bushel","Nonirrigated",40.57,42.29,35.65,42.279999999999994,40.31,38.549999999999997,34.799999999999997,39.590000000000003,39.515999999999998,38.963199999999993,0.41,null,39.483333333333341,{"$f":"'Background Calculations'!$M$54","v":5.03},198.60116666666673,178.74105000000006,23.832140000000006,{"$f":"'Farm Bill Calculator'!$E$22","v":151.57666666666668},{"$f":"'Farm Bill Calculator'!$E$30","v":4.12},624.49586666666676,0,0]
[null,"WashtenawSoybeansIrrigated","26121","Michigan","Washtenaw","","Soybeans","Bushel","Irrigated",67.510000000000005,64.62,57.14,55.220000000000006,66.790000000000006,62.48,60.970000000000006,68.14,63.160000000000004,64.748000000000005,0.44,null,63.413333333333334,{"$f":"'Background Calculations'!$M$54","v":5.03},318.96906666666666,287.07216,38.276288000000001,{"$f":"'Farm Bill Calculator'!$E$22","v":151.57666666666668},{"$f":"'Farm Bill Calculator'!$E$30","v":4.12},624.49586666666676,0,0]
[null,"WashtenawSoybeansNonirrigated","26121","Michigan","Washtenaw","","Soybeans","Bushel","Nonirrigated",40.580000000000005,43.53,47.14,42.32,48.11,40.450000000000003,48.43,44.91,45.283999999999999,45.876799999999996,0.44,null,45.113333333333323,{"$f":"'Background Calculations'!$M$54","v":5.03},226.92006666666663,204.22805999999997,27.230407999999994,{"$f":"'Farm Bill Calculator'!$E$22","v":151.57666666666668},{"$f":"'Farm Bill Calculator'!$E$30","v":4.12},624.49586666666676,0,0]
[null,"WayneSoybeansAll","26121","Michigan","Wayne","","Soybeans","Bushel","All",27.720000000000002,36.520000000000003,42.54,35.53,41.11,28.72,36.19,28.48,34.246000000000002,33.989200000000004,0.24,null,33.480000000000004,{"$f":"'Background Calculations'!$M$54","v":5.03},168.40440000000004,151.56396000000004,20.208528000000005,{"$f":"'Farm Bill Calculator'!$E$22","v":151.57666666666668},{"$f":"'Farm Bill Calculator'!$E$30","v":4.12},624.49586666666676,0,0]
[null,"WexfordSoybeansAll","26121","Michigan","Wexford","","Soybeans","Bushel","All",37,37,34.4,37.799999999999997,40.92,38.340000000000003,36.44,36.450000000000003,37.989999999999995,38.027999999999999,null,null,37.529999999999994,{"$f":"'Background Calculations'!$M$54","v":5.03},188.77589999999998,169.89830999999998,22.653107999999996,{"$f":"'Farm Bill Calculator'!$E$22","v":151.57666666666668},{"$f":"'Farm Bill Calculator'!$E$30","v":4.12},624.49586666666676,0,0]
[null,"AlconaWheatAll","26123","Michigan","Alcona","","Wheat","Bushel","All",49.32,47.83,58.66,59.68,53.93,67.72,65.42,69.3,63.82,64.647999999999996,0.61,null,64.273333333333326,{"$f":"'Background Calculations'!$M$54","v":5.03},323.29486666666662,290.96537999999998,38.795383999999991,{"$f":"'Farm Bill Calculator'!$E$22","v":151.57666666666668},{"$f":"'Farm Bill Calculator'!$E$30","v":4.12},624.49586666666676,0,0]
[null,"AlgerWheatAll","26123","Michigan","Alger","","Wheat","Bushel","All",53.6,40,53.1,50.4,61.66,65.89,57.83,69.3,61.015999999999998,63.139200000000002,null,null,61.793333333333329,{"$f":"'Background Calculations'!$M$54","v":5.03},310.82046666666668,279.73842000000002,37.298456000000002,{"$f":"'Farm Bill Calculator'!$E$22","v":151.57666666666668},{"$f":"'Farm Bill Calculator'!$E$30","v":4.12},624.49586666666676,0,0]
[null,"AlleganWheatAll","26123","Michigan","Allegan","","Wheat","Bushel","All",67.44,79.760000000000005,58.25,65.72,68.989999999999995,76.069999999999993,65.56,77.88,71.563999999999993,72.732799999999997,0.72,null,70.259999999999991,{"$f":"'Background Calculations'!$M$54","v":5.03},353.40779999999995,318.06701999999996,42.40893599999999,{"$f":"'Farm Bill Calculator'!$E$22","v":151.57666666666668},{"$f":"'Farm Bill Calculator'!$E$30","v":4.12},624.49586666666676,0,0]
[null,"AlpenaWheatAll","26123","Michigan","Alpena","","Wheat","Bushel","All",63.99,47.599999999999994,58.36,53.199999999999996,56.88,89.720000000000013,55.71,69.3,65.522000000000006,67.986400000000003,0.56000000000000005,null,60.629999999999995,{"$f":"'Background Calculations'!$M$54","v":5.03},304.96890000000002,274.47201000000001,36.596268000000002,{"$f":"'Farm Bill Calculator'!$E$22","v":151.57666666666668},{"$f":"'Farm Bill Calculator'!$E$30","v":4.12},624.49586666666676,0,0]
[null,"AntrimWheatAll","26125","Michigan","Antrim","","Wheat","Bushel","All",52,52.21,53.1,48,54.95,65.89,57.83,69.3,59.194000000000003,61.432800000000007,null,null,59.556666666666672,{"$f":"'Background Calculations'!$M$54","v":5.03},299.57003333333336,269.61303000000004,35.948404000000004,{"$f":"'Farm Bill Calculator'!$E$22","v":151.57666666666668},{"$f":"'Farm Bill Calculator'!$E$30","v":4.12},624.49586666666676,0,0]
[null,"ArenacWheatAll","26125","Michigan","Arenac","","Wheat","Bushel","All",70.41,79.510000000000005,61.239999999999995,65.7,82.539999999999992,72.429999999999993,82.660000000000011,88.94,79.194000000000003,81.892799999999994,0.74,null,79.210000000000022,{"$f":"'Background Calculations'!$M$54","v":5.03},398.42630000000014,358.58367000000015,47.811156000000018,{"$f":"'Farm Bill Calculator'!$E$22","v":151.57666666666668},{"$f":"'Farm Bill Calculator'!$E$30","v":4.12},624.49586666666676,0,0]
[null,"BarryWheatAll","26125","Michigan","Barry","","Wheat","Bushel","All",68,78.5,62.05,75.319999999999993,71.849999999999994,86.47,74.28,94.77,81.257999999999981,82.445599999999999,0.72,null,78.689999999999984,{"$f":"'Background Calculations'!$M$54","v":5.03},395.81069999999994,356.22962999999993,47.497283999999993,{"$f":"'Farm Bill Calculator'!$E$22","v":151.57666666666668},{"$f":"'Farm Bill Calculator'!$E$30","v":4.12},624.49586666666676,0,0]
[null,"BayWheatAll","26127","Michigan","Bay","","Wheat","Bushel","All",85.83,85.87,78.62,82.63000000000001,85.39,78.8,94.59,97.25,88.471999999999994,89.640399999999985,0.74,null,87.536666666666648,{"$f":"'Background Calculations'!$M$54","v":5.03},440.30943333333323,396.27848999999992,52.837131999999983,{"$f":"'Farm Bill Calculator'!$E$22","v":151.57666666666668},{"$f":"'Farm Bill Calculator'!$E$30","v":4.12},624.49586666666676,0,0]
[null,"BenzieWheatAll","26127","Michigan","Benzie","","Wheat","Bushel","All",54.32,76,53.1,45.04,47.98,65.89,57.83,69.3,57.208000000000006,59.641600000000004,null,null,57.233333333333348,{"$f":"'Background Calculations'!$M$54","v":5.03},287.88366666666678,259.09530000000012,34.546040000000012,{"$f":"'Farm Bill Calculator'!$E$22","v":151.57666666666668},{"$f":"'Farm Bill Calculator'!$E$30","v":4.12},624.49586666666676,0,0]
[null,"BerrienWheatAll","26127","Michigan","Berrien","","Wheat","Bushel","All",70.44,77.12,73.52,66.86,71.34,72.14,63.21,77.88,71.015999999999991,71.847200000000001,0.73,null,70.11333333333333,{"$f":"'Background Calculations'!$M$54","v":5.03},352.67006666666668,317.40306000000004,42.320408,{"$f":"'Farm Bill Calculator'!$E$22","v":151.57666666666668},{"$f":"'Farm Bill Calculator'!$E$30","v":4.12},624.49586666666676,0,0]
[null,"BranchWheatAll","26127","Michigan","Branch","","Wheat","Bushel","All",80.95,65.88,73.63,68.899999999999991,76.739999999999995,71.649999999999991,63.96,75.180000000000007,72.005999999999986,72.627199999999988,0.72,null,71.909999999999982,{"$f":"'Background Calculations'!$M$54","v":5.03},361.70729999999992,325.53656999999993,43.404875999999987,{"$f":"'Farm Bill Calculator'!$E$22","v":151.57666666666668},{"$f":"'Farm Bill Calculator'!$E$30","v":4.12},624.49586666666676,0,0]
[null,"CalhounWheatAll","26127","Michigan","Calhoun","","Wheat","Bushel","All",70.959999999999994,66.13,66.06,56.71,56.8,68.050000000000011,68.73,77.66,66.260000000000005,68.17,0.67,null,64.526666666666685,{"$f":"'Background Calculations'!$M$54","v":5.03},324.56913333333347,292.11222000000015,38.948296000000013,{"$f":"'Farm Bill Calculator'!$E$22","v":151.57666666666668},{"$f":"'Farm Bill Calculator'!$E$30","v":4.12},624.49586666666676,0,0]
[null,"CassWheatAll","26129","Michigan","Cass","","Wheat","Bushel","All",68.27000000000001,64.95,64.39,68.990000000000009,56.3,61.07,58.69,77.88,65.176000000000002,64.413200000000003,0.59,null,62.916666666666664,{"$f":"'Background Calculations'!$M$54","v":5.03},316.47083333333336,284.82375000000002,37.976500000000001,{"$f":"'Farm Bill Calculator'!$E$22","v":151.57666666666668},{"$f":"'Farm Bill Calculator'!$E$30","v":4.12},624.49586666666676,0,0]
[null,"CharlevoixWheatAll","26129","Michigan","Charlevoix","","Wheat","Bushel","All",55.2,40,55.2,55.2,55.2,65.89,55.2,69.3,60.158000000000001,61.149600000000007,null,null,58.763333333333343,{"$f":"'Background Calculations'!$M$54","v":5.03},295.57956666666672,266.02161000000007,35.469548000000003,{"$f":"'Farm Bill Calculator'!$E$22","v":151.57666666666668},{"$f":"'Farm Bill Calculator'!$E$30","v":4.12},624.49586666666676,0,0]
[null,"CheboyganWheatAll","26129","Michigan","Cheboygan","","Wheat","Bushel","All",52,47,52,52,52,65.89,57.83,69.3,59.403999999999996,60.884799999999998,null,null,58.573333333333323,{"$f":"'Background Calculations'!$M$54","v":5.03},294.62386666666663,265.16147999999998,35.354863999999992,{"$f":"'Farm Bill Calculator'!$E$22","v":151.57666666666668},{"$f":"'Farm Bill Calculator'!$E$30","v":4.12},624.49586666666676,0,0]
[null,"ChippewaWheatAll","26131","Michigan","Chippewa","","Wheat","Bushel","All",52,40,53.1,50.4,61.66,65.89,57.83,69.3,61.015999999999998,63.139200000000002,null,null,61.793333333333329,{"$f":"'Background Calculations'!$M$54","v":5.03},310.82046666666668,279.73842000000002,37.298456000000002,{"$f":"'Farm Bill Calculator'!$E$22","v":151.57666666666668},{"$f":"'Farm Bill Calculator'!$E$30","v":4.12},624.49586666666676,0,0]
[null,"ClareWheatAll","26131","Michigan","Clare","","Wheat","Bushel","All",47.8,65.209999999999994,50.72,55,69.05,62.21,53.45,72.349999999999994,62.411999999999992,63.894399999999983,null,null,62.086666666666652,{"$f":"'Background Calculations'!$M$54","v":5.03},312.29593333333327,281.06633999999997,37.475511999999988,{"$f":"'Farm Bill Calculator'!$E$22","v":151.57666666666668},{"$f":"'Farm Bill Calculator'!$E$30","v":4.12},624.49586666666676,0,0]
[null,"ClintonWheatAll","26133","Michigan","Clinton","","Wheat","Bushel","All",78.55,93.56,76.59,80.11,83.82,74.53,83.02000000000001,85.24,82.084000000000003,82.478799999999993,0.74,null,82.316666666666677,{"$f":"'Background Calculations'!$M$54","v":5.03},414.05283333333341,372.64755000000008,49.686340000000008,{"$f":"'Farm Bill Calculator'!$E$22","v":151.57666666666668},{"$f":"'Farm Bill Calculator'!$E$30","v":4.12},624.49586666666676,0,0]
[null,"DeltaWheatAll","26133","Michigan","Delta","","Wheat","Bushel","All",52,40,53.1,50.4,61.66,65.89,57.83,69.3,61.015999999999998,63.139200000000002,null,null,61.793333333333329,{"$f":"'Background Calculations'!$M$54","v":5.03},310.82046666666668,279.73842000000002,37.298456000000002,{"$f":"'Farm Bill Calculator'!$E$22","v":151.57666666666668},{"$f":"'Farm Bill Calculator'!$E$30","v":4.12},624.49586666666676,0,0]
[null,"EatonWheatAll","26133","Michigan","Eaton","","Wheat","Bushel","All",77.5,78.86,64.210000000000008,76.22,75.099999999999994,80.539999999999992,81.06,76.34,78.572000000000003,79.042399999999986,0.72,null,77.699999999999989,{"$f":"'Background Calculations'!$M$54","v":5.03},390.83099999999996,351.74789999999996,46.899719999999995,{"$f":"'Farm Bill Calculator'!$E$22","v":151.57666666666668},{"$f":"'Farm Bill Calculator'!$E$30","v":4.12},624.49586666666676,0,0]
[null,"EmmetWheatAll","26135","Michigan","Emmet","","Wheat","Bushel","All",55.2,40,55.2,55.2,55.2,65.89,57.83,69.3,60.684000000000005,61.780800000000013,null,null,59.640000000000008,{"$f":"'Background Calculations'!$M$54","v":5.03},299.98920000000004,269.99028000000004,35.998704000000004,{"$f":"'Farm Bill Calculator'!$E$22","v":151.57666666666668},{"$f":"'Farm Bill Calculator'!$E$30","v":4.12},624.49586666666676,0,0]
[null,"GeneseeWheatAll","26137","Michigan","Genesee","","Wheat","Bushel","All",72.98,79.58,67.34,63.870000000000005,80.55,77.34,87.12,81.67,78.849999999999994,81.845999999999989,0.74,null,79.853333333333339,{"$f":"'Background Calculations'!$M$54","v":5.03},401.66226666666671,361.49604000000005,48.199472,{"$f":"'Farm Bill Calculator'!$E$22","v":151.57666666666668},{"$f":"'Farm Bill Calculator'!$E$30","v":4.12},624.49586666666676,0,0]
[null,"GladwinWheatAll","26137","Michigan","Gladwin","","Wheat","Bushel","All",62.94,77.210000000000008,60.64,60,78.460000000000008,61.92,61.28,76.42,68.256,69.907200000000003,0.64,null,66.539999999999992,{"$f":"'Background Calculations'!$M$54","v":5.03},334.69619999999998,301.22658000000001,40.163543999999995,{"$f":"'Farm Bill Calculator'!$E$22","v":151.57666666666668},{"$f":"'Farm Bill Calculator'!$E$30","v":4.12},624.49586666666676,0,0]
[null,"Grand TraverseWheatAll","26137","Michigan","Grand Traverse","","Wheat","Bushel","All",56.199999999999996,39.11,48.1,46.129999999999995,49.62,60.54,40.229999999999997,57.07,51.127999999999993,52.127599999999987,0.41,null,50.94,{"$f":"'Background Calculations'!$M$54","v":5.03},256.22820000000002,230.60538000000003,30.747384,{"$f":"'Farm Bill Calculator'!$E$22","v":151.57666666666668},{"$f":"'Farm Bill Calculator'!$E$30","v":4.12},624.49586666666676,0,0]
[null,"GratiotWheatAll","26139","Michigan","Gratiot","","Wheat","Bushel","All",80.44,93.37,72.16,70.95,87.13,73.25,78.910000000000011,92.77,81.341999999999999,83.420399999999987,0.74,null,79.763333333333335,{"$f":"'Background Calculations'!$M$54","v":5.03},401.20956666666672,361.08861000000007,48.145148000000006,{"$f":"'Farm Bill Calculator'!$E$22","v":151.57666666666668},{"$f":"'Farm Bill Calculator'!$E$30","v":4.12},624.49586666666676,0,0]
[null,"HillsdaleWheatAll","26139","Michigan","Hillsdale","","Wheat","Bushel","All",86.4,75.760000000000005,62.4,66.709999999999994,77.88,76.03,80.95,87.88,78.63,81.013999999999996,0.74,null,78.286666666666676,{"$f":"'Background Calculations'!$M$54","v":5.03},393.78193333333343,354.40374000000008,47.25383200000001,{"$f":"'Farm Bill Calculator'!$E$22","v":151.57666666666668},{"$f":"'Farm Bill Calculator'!$E$30","v":4.12},624.49586666666676,0,0]
[null,"HuronWheatAll","26139","Michigan","Huron","","Wheat","Bushel","All",100.48,87.36,94.75,97.39,90.839999999999989,101.53,107.11,105.99,101.312,102.0964,0.74,null,101.63666666666667,{"$f":"'Background Calculations'!$M$54","v":5.03},511.2324333333334,460.10919000000007,61.347892000000009,{"$f":"'Farm Bill Calculator'!$E$22","v":151.57666666666668},{"$f":"'Farm Bill Calculator'!$E$30","v":4.12},624.49586666666676,0,0]
[null,"InghamWheatAll","26139","Michigan","Ingham","","Wheat","Bushel","All",76.03,85.36,75.25,77.28,79.959999999999994,68.33,81.820000000000007,73.22,76.861999999999995,76.778399999999991,0.74,null,76.820000000000007,{"$f":"'Background Calculations'!$M$54","v":5.03},386.40460000000007,347.76414000000005,46.368552000000008,{"$f":"'Farm Bill Calculator'!$E$22","v":151.57666666666668},{"$f":"'Farm Bill Calculator'!$E$30","v":4.12},624.49586666666676,0,0]
[null,"IoniaWheatAll","26139","Michigan","Ionia","","Wheat","Bushel","All",81.47,88.76,74.039999999999992,73.66,86.49,91.52,87.02000000000001,88.46,86.169999999999973,88.671999999999983,0.74,null,87.323333333333309,{"$f":"'Background Calculations'!$M$54","v":5.03},439.23636666666658,395.31272999999993,52.708363999999989,{"$f":"'Farm Bill Calculator'!$E$22","v":151.57666666666668},{"$f":"'Farm Bill Calculator'!$E$30","v":4.12},624.49586666666676,0,0]
[null,"IoscoWheatAll","26141","Michigan","Iosco","","Wheat","Bushel","All",77.289999999999992,63.32,59.02,58.08,84.67,82.660000000000011,78.86,69.3,75.384000000000015,78.844800000000006,0.67,null,76.940000000000012,{"$f":"'Background Calculations'!$M$54","v":5.03},387.0082000000001,348.30738000000008,46.440984000000007,{"$f":"'Farm Bill Calculator'!$E$22","v":151.57666666666668},{"$f":"'Farm Bill Calculator'!$E$30","v":4.12},624.49586666666676,0,0]
[null,"IronWheatAll","26141","Michigan","Iron","","Wheat","Bushel","All",53.6,40,53.1,50.4,61.66,65.89,57.83,69.3,61.015999999999998,63.139200000000002,null,null,61.793333333333329,{"$f":"'Background Calculations'!$M$54","v":5.03},310.82046666666668,279.73842000000002,37.298456000000002,{"$f":"'Farm Bill Calculator'!$E$22","v":151.57666666666668},{"$f":"'Farm Bill Calculator'!$E$30","v":4.12},624.49586666666676,0,0]
[null,"IsabellaWheatAll","26141","Michigan","Isabella","","Wheat","Bushel","All",77.849999999999994,82.51,62.65,61.410000000000004,89.47999999999999,66.41,68.62,82.81,74.48599999999999,77.101199999999992,0.74,null,72.613333333333316,{"$f":"'Background Calculations'!$M$54","v":5.03},365.24506666666662,328.72055999999998,43.829407999999994,{"$f":"'Farm Bill Calculator'!$E$22","v":151.57666666666668},{"$f":"'Farm Bill Calculator'!$E$30","v":4.12},624.49586666666676,0,0]
[null,"JacksonWheatAll","26143","Michigan","Jackson","","Wheat","Bushel","All",77.73,65.08,71.73,71.64,60.56,81.22,69.239999999999995,77.77,72.795999999999978,73.027199999999979,0.71,null,72.883333333333312,{"$f":"'Background Calculations'!$M$54","v":5.03},366.6031666666666,329.94284999999996,43.99237999999999,{"$f":"'Farm Bill Calculator'!$E$22","v":151.57666666666668},{"$f":"'Farm Bill Calculator'!$E$30","v":4.12},624.49586666666676,0,0]
[null,"KalamazooWheatAll","26145","Michigan","Kalamazoo","","Wheat","Bushel","All",73.84,68.97,65.45,70.08,56.56,84.23,70.350000000000009,77.88,72.56,73.055999999999997,0.74,null,72.77,{"$f":"'Background Calculations'!$M$54","v":5.03},366.03309999999999,329.42979000000003,43.923971999999999,{"$f":"'Farm Bill Calculator'!$E$22","v":151.57666666666668},{"$f":"'Farm Bill Calculator'!$E$30","v":4.12},624.49586666666676,0,0]
[null,"KalkaskaWheatAll","26145","Michigan","Kalkaska","","Wheat","Bushel","All",52,71.56,53.1,48.63,61.92,65.89,57.83,77.88,62.429999999999993,65.19,null,null,61.879999999999995,{"$f":"'Background Calculations'!$M$54","v":5.03},311.25639999999999,280.13076000000001,37.350767999999995,{"$f":"'Farm Bill Calculator'!$E$22","v":151.57666666666668},{"$f":"'Farm Bill Calculator'!$E$30","v":4.12},624.49586666666676,0,0]
[null,"KentWheatAll","26145","Michigan","Kent","","Wheat","Bushel","All",61.82,78.320000000000007,70.400000000000006,57.14,71.83,79.490000000000009,76.13,81.599999999999994,73.888000000000019,77.2376,0.65,null,75.816666666666691,{"$f":"'Background Calculations'!$M$54","v":5.03},381.35783333333347,343.22205000000014,45.762940000000015,{"$f":"'Farm Bill Calculator'!$E$22","v":151.57666666666668},{"$f":"'Farm Bill Calculator'!$E$30","v":4.12},624.49586666666676,0,0]
[null,"LakeWheatAll","26145","Michigan","Lake","","Wheat","Bushel","All",65,66,51.6,52.97,66.97,65.89,57.83,69.3,62.591999999999999,64.516400000000004,null,null,63.563333333333333,{"$f":"'Background Calculations'!$M$54","v":5.03},319.72356666666667,287.75121000000001,38.366827999999998,{"$f":"'Farm Bill Calculator'!$E$22","v":151.57666666666668},{"$f":"'Farm Bill Calculator'!$E$30","v":4.12},624.49586666666676,0,0]
[null,"LapeerWheatAll","26151","Michigan","Lapeer","","Wheat","Bushel","All",77.84,81.67,61.089999999999996,69.53,81.61,83.92,78.990000000000009,73.59,78.267999999999986,80.015599999999992,0.74,null,78.063333333333333,{"$f":"'Background Calculations'!$M$54","v":5.03},392.65856666666667,353.39271000000002,47.119028,{"$f":"'Farm Bill Calculator'!$E$22","v":151.57666666666668},{"$f":"'Farm Bill Calculator'!$E$30","v":4.12},624.49586666666676,0,0]
[null,"LeelanauWheatAll","26151","Michigan","Leelanau","","Wheat","Bushel","All",52,40,53.1,44.08,47.98,65.89,57.83,69.3,57.015999999999998,59.603200000000001,null,null,57.233333333333327,{"$f":"'Background Calculations'!$M$54","v":5.03},287.88366666666667,259.09530000000001,34.546039999999998,{"$f":"'Farm Bill Calculator'!$E$22","v":151.57666666666668},{"$f":"'Farm Bill Calculator'!$E$30","v":4.12},624.49586666666676,0,0]
[null,"LenaweeWheatAll","26151","Michigan","Lenawee","","Wheat","Bushel","All",89.79,82.79,65.239999999999995,74.06,94.429999999999993,79.73,92.960000000000008,96.21,88.218000000000004,91.049599999999998,0.74,null,89.04000000000002,{"$f":"'Background Calculations'!$M$54","v":5.03},447.8712000000001,403.08408000000009,53.744544000000012,{"$f":"'Farm Bill Calculator'!$E$22","v":151.57666666666668},{"$f":"'Farm Bill Calculator'!$E$30","v":4.12},624.49586666666676,0,0]
[null,"LivingstonWheatAll","26153","Michigan","Livingston","","Wheat","Bushel","All",81.42,73.959999999999994,59.47,74.28,68.649999999999991,69.08,67.14,73.739999999999995,71.317999999999998,70.7256,0.74,null,70.489999999999995,{"$f":"'Background Calculations'!$M$54","v":5.03},354.56470000000002,319.10823000000005,42.547764000000001,{"$f":"'Farm Bill Calculator'!$E$22","v":151.57666666666668},{"$f":"'Farm Bill Calculator'!$E$30","v":4.12},624.49586666666676,0,0]
[null,"LuceWheatAll","26153","Michigan","Luce","","Wheat","Bushel","All",53.6,40,53.1,50.4,61.66,65.89,57.83,69.3,61.015999999999998,63.139200000000002,null,null,61.793333333333329,{"$f":"'Background Calculations'!$M$54","v":5.03},310.82046666666668,279.73842000000002,37.298456000000002,{"$f":"'Farm Bill Calculator'!$E$22","v":151.57666666666668},{"$f":"'Farm Bill Calculator'!$E$30","v":4.12},624.49586666666676,0,0]
[null,"MackinacWheatAll","26155","Michigan","Mackinac","","Wheat","Bushel","All",52,40,53.1,50.4,61.66,65.89,57.83,69.3,61.015999999999998,63.139200000000002,null,null,61.793333333333329,{"$f":"'Background Calculations'!$M$54","v":5.03},310.82046666666668,279.73842000000002,37.298456000000002,{"$f":"'Farm Bill Calculator'!$E$22","v":151.57666666666668},{"$f":"'Farm Bill Calculator'!$E$30","v":4.12},624.49586666666676,0,0]
[null,"MacombWheatAll","26155","Michigan","Macomb","","Wheat","Bushel","All",71.16,74.180000000000007,68.7,70.11,69.759999999999991,81.62,68.290000000000006,80.83,74.861999999999995,75.812399999999982,0.74,null,73.566666666666663,{"$f":"'Background Calculations'!$M$54","v":5.03},370.04033333333331,333.03629999999998,44.404839999999993,{"$f":"'Farm Bill Calculator'!$E$22","v":151.57666666666668},{"$f":"'Farm Bill Calculator'!$E$30","v":4.12},624.49586666666676,0,0]
[null,"ManisteeWheatAll","26155","Michigan","Manistee","","Wheat","Bushel","All",52,40,53.1,46,63.48,65.89,57.83,69.3,60.5,63.4,null,null,62.4,{"$f":"'Background Calculations'!$M$54","v":5.03},313.87200000000001,282.48480000000001,37.664639999999999,{"$f":"'Farm Bill Calculator'!$E$22","v":151.57666666666668},{"$f":"'Farm Bill Calculator'!$E$30","v":4.12},624.49586666666676,0,0]
[null,"MarquetteWheatAll","26155","Michigan","Marquette","","Wheat","Bushel","All",54.32,48.06,53.1,50.4,61.66,65.89,57.83,69.3,61.015999999999998,63.139200000000002,null,null,61.793333333333329,{"$f":"'Background Calculations'!$M$54","v":5.03},310.82046666666668,279.73842000000002,37.298456000000002,{"$f":"'Farm Bill Calculator'!$E$22","v":151.57666666666668},{"$f":"'Farm Bill Calculator'!$E$30","v":4.12},624.49586666666676,0,0]
[null,"MasonWheatAll","26147","Michigan","Mason","","Wheat","Bushel","All",59.86,58.48,61.91,55.440000000000005,80.97,69.44,62.199999999999996,72.36,68.602000000000004,71.234399999999994,0.52,null,68.000000000000014,{"$f":"'Background Calculations'!$M$54","v":5.03},342.04000000000008,307.83600000000007,41.044800000000009,{"$f":"'Farm Bill Calculator'!$E$22","v":151.57666666666668},{"$f":"'Farm Bill Calculator'!$E$30","v":4.12},624.49586666666676,0,0]
[null,{"$f":"E261&G261&I261","v":"MecostaWheatAll"},"26147","Michigan","Mecosta","","Wheat","Bushel","All",62.47,60.199999999999996,52.57,51.25,69.91,72.220000000000013,70.150000000000006,77.510000000000005,68.768000000000001,72.271600000000007,0.56000000000000005,null,70.759999999999991,{"$f":"'Background Calculations'!$M$54","v":5.03},355.9228,320.33051999999998,42.710735999999997,{"$f":"'Farm Bill Calculator'!$E$22","v":151.57666666666668},{"$f":"'Farm Bill Calculator'!$E$30","v":4.12},624.49586666666676,0,0]
[null,"MenomineeWheatAll","26147","Michigan","Menominee","","Wheat","Bushel","All",53.6,40,53.6,53.6,61.66,65.89,57.83,69.3,{"$f":"AVERAGE(M262:Q262)+T262","v":61.655999999999992},{"$f":"AVERAGE(N262:R262)+T262","v":63.267200000000003},null,null,{"$f":"(SUM(M262:Q262)-MIN(M262:Q262)-MAX(M262:Q262))/(COUNT(M262:Q262)-2)","v":61.793333333333329},{"$f":"'Background Calculations'!$M$54","v":5.03},{"$f":"V262*W262","v":310.82046666666668},{"$f":"X262*0.9","v":279.73842000000002},{"$f":"X262*0.12","v":37.298456000000002},{"$f":"'Farm Bill Calculator'!$E$22","v":151.57666666666668},{"$f":"'Farm Bill Calculator'!$E$30","v":4.12},{"$f":"AB262*AA262","v":624.49586666666676},{"$f":"IF(Y262-AC262>0,Y262-AC262,0)","v":0},{"$f":"MIN(AD262,Z262)","v":0}]
[null,"MidlandWheatAll","26149","Michigan","Midland","","Wheat","Bushel","All",72.69,91.73,67.64,66.900000000000006,72.64,66.22,75.75,94.41,75.923999999999992,77.728799999999993,0.74,null,71.763333333333307,{"$f":"'Background Calculations'!$M$54","v":5.03},360.96956666666654,324.8726099999999,43.316347999999984,{"$f":"'Farm Bill Calculator'!$E$22","v":151.57666666666668},{"$f":"'Farm Bill Calculator'!$E$30","v":4.12},624.49586666666676,0,0]
[null,"MissaukeeWheatAll","26149","Michigan","Missaukee","","Wheat","Bushel","All",54.94,56.84,56.04,52.35,66.559999999999988,67.36,58.809999999999995,69.3,63.366,65.569199999999981,0.49,null,64.243333333333325,{"$f":"'Background Calculations'!$M$54","v":5.03},323.14396666666664,290.82956999999999,38.777275999999993,{"$f":"'Farm Bill Calculator'!$E$22","v":151.57666666666668},{"$f":"'Farm Bill Calculator'!$E$30","v":4.12},624.49586666666676,0,0]
[null,"MonroeWheatAll","26149","Michigan","Monroe","","Wheat","Bushel","All",89.74,82.59,65.239999999999995,72.33,94.029999999999987,90.89,93.54,93.7,89.637999999999991,93.099599999999981,0.74,null,92.710000000000022,{"$f":"'Background Calculations'!$M$54","v":5.03},466.33130000000011,419.69817000000012,55.959756000000013,{"$f":"'Farm Bill Calculator'!$E$22","v":151.57666666666668},{"$f":"'Farm Bill Calculator'!$E$30","v":4.12},624.49586666666676,0,0]
[null,"MontcalmWheatIrrigated","26149","Michigan","Montcalm","","Wheat","Bushel","Irrigated",75.78,74.010000000000005,76.849999999999994,56.330000000000005,65.02,71.089999999999989,91.33,86.93,74.83,78.53,0.69,null,74.346666666666678,{"$f":"'Background Calculations'!$M$54","v":5.03},373.96373333333344,336.56736000000012,44.875648000000012,{"$f":"'Farm Bill Calculator'!$E$22","v":151.57666666666668},{"$f":"'Farm Bill Calculator'!$E$30","v":4.12},624.49586666666676,0,0]
[null,"MontcalmWheatNonirrigated","26149","Michigan","Montcalm","","Wheat","Bushel","Nonirrigated",67.33,74.67,64.72,62.83,70.410000000000011,66.87,58.7,81.260000000000005,68.683999999999997,69.854799999999997,0.67,null,66.703333333333333,{"$f":"'Background Calculations'!$M$54","v":5.03},335.51776666666666,301.96598999999998,40.262132000000001,{"$f":"'Farm Bill Calculator'!$E$22","v":151.57666666666668},{"$f":"'Farm Bill Calculator'!$E$30","v":4.12},624.49586666666676,0,0]
[null,"MontmorencyWheatAll","26157","Michigan","Montmorency","","Wheat","Bushel","All",61.16,50.05,50.88,54.92,55.47,67.69,61.2,69.3,62.315999999999995,63.795200000000001,0.6,null,61.453333333333319,{"$f":"'Background Calculations'!$M$54","v":5.03},309.11026666666663,278.19923999999997,37.093231999999993,{"$f":"'Farm Bill Calculator'!$E$22","v":151.57666666666668},{"$f":"'Farm Bill Calculator'!$E$30","v":4.12},624.49586666666676,0,0]
[null,"MuskegonWheatAll","26157","Michigan","Muskegon","","Wheat","Bushel","All",64.59,58.24,52.21,41.35,69.8,77.27000000000001,51.05,77.510000000000005,63.826000000000001,68.321200000000005,0.43,null,66.040000000000006,{"$f":"'Background Calculations'!$M$54","v":5.03},332.18120000000005,298.96308000000005,39.861744000000002,{"$f":"'Farm Bill Calculator'!$E$22","v":151.57666666666668},{"$f":"'Farm Bill Calculator'!$E$30","v":4.12},624.49586666666676,0,0]
[null,"NewaygoWheatAll","26157","Michigan","Newaygo","","Wheat","Bushel","All",71.88,68.819999999999993,49.33,57.47,65.180000000000007,50.9,55.47,77.510000000000005,61.306000000000004,62.0732,null,null,59.373333333333335,{"$f":"'Background Calculations'!$M$54","v":5.03},298.64786666666669,268.78308000000004,35.837744000000001,{"$f":"'Farm Bill Calculator'!$E$22","v":151.57666666666668},{"$f":"'Farm Bill Calculator'!$E$30","v":4.12},624.49586666666676,0,0]
[null,"OaklandWheatAll","26157","Michigan","Oakland","","Wheat","Bushel","All",68.14,75,58.54,67.33,65.64,69.53,69.25,80.83,70.515999999999991,71.153199999999998,null,null,68.703333333333333,{"$f":"'Background Calculations'!$M$54","v":5.03},345.57776666666666,311.01999000000001,41.469332000000001,{"$f":"'Farm Bill Calculator'!$E$22","v":151.57666666666668},{"$f":"'Farm Bill Calculator'!$E$30","v":4.12},624.49586666666676,0,0]
[null,"OceanaWheatAll","26157","Michigan","Oceana","","Wheat","Bushel","All",77,68.5,56.14,51.09,69.309999999999988,60.269999999999996,55.529999999999994,77.510000000000005,63.231999999999999,65.660399999999996,0.49,null,61.70333333333334,{"$f":"'Background Calculations'!$M$54","v":5.03},310.36776666666674,279.3309900000001,37.244132000000008,{"$f":"'Farm Bill Calculator'!$E$22","v":151.57666666666668},{"$f":"'Farm Bill Calculator'!$E$30","v":4.12},624.49586666666676,0,0]
[null,"OgemawWheatAll","26159","Michigan","Ogemaw","","Wheat","Bushel","All",63.7,64.55,65.179999999999993,64.45,75.95,74.849999999999994,70.75,66.38,71.206000000000003,72.557200000000009,0.73,null,70.660000000000011,{"$f":"'Background Calculations'!$M$54","v":5.03},355.41980000000007,319.87782000000004,42.650376000000009,{"$f":"'Farm Bill Calculator'!$E$22","v":151.57666666666668},{"$f":"'Farm Bill Calculator'!$E$30","v":4.12},624.49586666666676,0,0]
[null,"OntonagonWheatAll","26159","Michigan","Ontonagon","","Wheat","Bushel","All",52,40,53.1,50.4,61.66,65.89,57.83,69.3,61.015999999999998,63.139200000000002,null,null,61.793333333333329,{"$f":"'Background Calculations'!$M$54","v":5.03},310.82046666666668,279.73842000000002,37.298456000000002,{"$f":"'Farm Bill Calculator'!$E$22","v":151.57666666666668},{"$f":"'Farm Bill Calculator'!$E$30","v":4.12},624.49586666666676,0,0]
[null,"OsceolaWheatAll","26159","Michigan","Osceola","","Wheat","Bushel","All",69,57.92,53.71,64.400000000000006,68.39,58.88,48.8,69.3,61.954000000000008,61.464800000000004,null,null,63.890000000000008,{"$f":"'Background Calculations'!$M$54","v":5.03},321.36670000000004,289.23003000000006,38.564004000000004,{"$f":"'Farm Bill Calculator'!$E$22","v":151.57666666666668},{"$f":"'Farm Bill Calculator'!$E$30","v":4.12},624.49586666666676,0,0]
[null,"OtsegoWheatAll","26159","Michigan","Otsego","","Wheat","Bushel","All",45.53,60,47.28,51.92,61.92,62.02,60.1,69.3,61.052,62.878399999999999,null,null,61.346666666666657,{"$f":"'Background Calculations'!$M$54","v":5.03},308.57373333333328,277.71635999999995,37.028847999999989,{"$f":"'Farm Bill Calculator'!$E$22","v":151.57666666666668},{"$f":"'Farm Bill Calculator'!$E$30","v":4.12},624.49586666666676,0,0]
[null,"OttawaWheatAll","26159","Michigan","Ottawa","","Wheat","Bushel","All",59.480000000000004,77.740000000000009,61.35,60.230000000000004,81.88,74.47,61.05,60.21,68.287999999999997,69.899599999999992,0.72,null,65.25,{"$f":"'Background Calculations'!$M$54","v":5.03},328.20750000000004,295.38675000000006,39.384900000000002,{"$f":"'Farm Bill Calculator'!$E$22","v":151.57666666666668},{"$f":"'Farm Bill Calculator'!$E$30","v":4.12},624.49586666666676,0,0]
[null,"Presque IsleWheatAll","26161","Michigan","Presque Isle","","Wheat","Bushel","All",58.88,45.6,50.82,52.75,56.52,60.279999999999994,48.16,51.55,54.321999999999996,54.636399999999995,0.47,null,53.606666666666662,{"$f":"'Background Calculations'!$M$54","v":5.03},269.64153333333331,242.67738,32.356983999999997,{"$f":"'Farm Bill Calculator'!$E$22","v":151.57666666666668},{"$f":"'Farm Bill Calculator'!$E$30","v":4.12},624.49586666666676,0,0]
[null,"SaginawWheatAll","26161","Michigan","Saginaw","","Wheat","Bushel","All",80.319999999999993,90.65,77.97,73.37,85.11999999999999,78.64,91.18,91.48,84.697999999999993,86.9636,0.74,null,84.98,{"$f":"'Background Calculations'!$M$54","v":5.03},427.44940000000003,384.70446000000004,51.293928000000001,{"$f":"'Farm Bill Calculator'!$E$22","v":151.57666666666668},{"$f":"'Farm Bill Calculator'!$E$30","v":4.12},624.49586666666676,0,0]
[null,"SanilacWheatAll","26161","Michigan","Sanilac","","Wheat","Bushel","All",92.4,94.02,58.04,73.98,79.97999999999999,79.64,79.850000000000009,76.7,78.77,79.727999999999994,0.74,null,78.72999999999999,{"$f":"'Background Calculations'!$M$54","v":5.03},396.01189999999997,356.41070999999999,47.521427999999993,{"$f":"'Farm Bill Calculator'!$E$22","v":151.57666666666668},{"$f":"'Farm Bill Calculator'!$E$30","v":4.12},624.49586666666676,0,0]
[null,"SchoolcraftWheatAll","26161","Michigan","Schoolcraft","","Wheat","Bushel","All",53.6,40,68.160000000000011,71.78,64.42,80.44,70.83,77.88,73.72,74.108000000000004,0.65,null,73.496666666666655,{"$f":"'Background Calculations'!$M$54","v":5.03},369.6882333333333,332.71940999999998,44.362587999999995,{"$f":"'Farm Bill Calculator'!$E$22","v":151.57666666666668},{"$f":"'Farm Bill Calculator'!$E$30","v":4.12},624.49586666666676,0,0]
[null,"ShiawasseeWheatAll","26161","Michigan","Shiawassee","","Wheat","Bushel","All",71.31,91.87,79.47,93.710000000000008,92.71,96.53,94.68,99.06,96.078000000000003,96.551599999999993,0.74,null,94.973333333333358,{"$f":"'Background Calculations'!$M$54","v":5.03},477.71586666666678,429.94428000000011,57.325904000000016,{"$f":"'Farm Bill Calculator'!$E$22","v":151.57666666666668},{"$f":"'Farm Bill Calculator'!$E$30","v":4.12},624.49586666666676,0,0]
[null,"St. ClairWheatAll","26163","Michigan","St. Clair","","Wheat","Bushel","All",71.47,85.17,53.6,53.6,61.66,65.89,57.83,69.3,61.655999999999992,63.267200000000003,null,null,61.793333333333329,{"$f":"'Background Calculations'!$M$54","v":5.03},310.82046666666668,279.73842000000002,37.298456000000002,{"$f":"'Farm Bill Calculator'!$E$22","v":151.57666666666668},{"$f":"'Farm Bill Calculator'!$E$30","v":4.12},624.49586666666676,0,0]
[null,"St. JosephWheatAll","26163","Michigan","St. Joseph","","Wheat","Bushel","All",87.710000000000008,63.2,66.010000000000005,76.010000000000005,81.779999999999987,78.56,81.92,81.36,80.665999999999997,81.597200000000001,0.74,null,80.566666666666663,{"$f":"'Background Calculations'!$M$54","v":5.03},405.25033333333334,364.7253,48.630040000000001,{"$f":"'Farm Bill Calculator'!$E$22","v":151.57666666666668},{"$f":"'Farm Bill Calculator'!$E$30","v":4.12},624.49586666666676,0,0]
[null,"TuscolaWheatAll","26163","Michigan","Tuscola","","Wheat","Bushel","All",91.15,87.09,81.99,86.070000000000007,84.759999999999991,96,89.56,99.6,91.938000000000002,93.111599999999981,0.74,null,90.543333333333337,{"$f":"'Background Calculations'!$M$54","v":5.03},455.43296666666669,409.88967000000002,54.651955999999998,{"$f":"'Farm Bill Calculator'!$E$22","v":151.57666666666668},{"$f":"'Farm Bill Calculator'!$E$30","v":4.12},624.49586666666676,0,0]
[null,"Van BurenWheatAll","26165","Michigan","Van Buren","","Wheat","Bushel","All",69.3,64.75,64.150000000000006,67.81,43.800000000000004,74.38000000000001,67.089999999999989,77.88,66.74199999999999,66.528399999999991,0.55000000000000004,null,69.759999999999991,{"$f":"'Background Calculations'!$M$54","v":5.03},350.89279999999997,315.80351999999999,42.107135999999997,{"$f":"'Farm Bill Calculator'!$E$22","v":151.57666666666668},{"$f":"'Farm Bill Calculator'!$E$30","v":4.12},624.49586666666676,0,0]
[null,"WashtenawWheatAll","26165","Michigan","Washtenaw","","Wheat","Bushel","All",83.54,71.989999999999995,64.38,67.55,74.61999999999999,78.849999999999994,76.31,85.55,77.315999999999988,79.269199999999984,0.74,null,76.59333333333332,{"$f":"'Background Calculations'!$M$54","v":5.03},385.26446666666664,346.73802000000001,46.231735999999998,{"$f":"'Farm Bill Calculator'!$E$22","v":151.57666666666668},{"$f":"'Farm Bill Calculator'!$E$30","v":4.12},624.49586666666676,0,0]
[null,"WayneWheatAll","26165","Michigan","Wayne","","Wheat","Bushel","All",77,75,52,67.319999999999993,68.03,78.56,62.34,80.83,71.415999999999997,72.235199999999992,null,null,71.303333333333342,{"$f":"'Background Calculations'!$M$54","v":5.03},358.65576666666675,322.79019000000011,43.038692000000012,{"$f":"'Farm Bill Calculator'!$E$22","v":151.57666666666668},{"$f":"'Farm Bill Calculator'!$E$30","v":4.12},624.49586666666676,0,0]
[null,"WexfordWheatAll","26165","Michigan","Wexford","","Wheat","Bushel","All",52,40,53.1,51.1,58.17,65.89,57.83,69.3,60.458000000000006,62.329600000000006,null,null,60.630000000000017,{"$f":"'Background Calculations'!$M$54","v":5.03},304.96890000000008,274.47201000000007,36.596268000000009,{"$f":"'Farm Bill Calculator'!$E$22","v":151.57666666666668},{"$f":"'Farm Bill Calculator'!$E$30","v":4.12},624.49586666666676,0,0]

{"sheet":"SCO Coverage","index":5,"n_rows":9,"n_cols":2,"rows_kept":9,"cut":false,"hidden":true,"merged":[]}
[null,0]
[null,"85-86%"]
[null,"80-86%"]
[null,"75-86%"]
[null,"70-86%"]
[null,"65-86%"]
[null,"60-86%"]
[null,"55-86%"]
[null,"50-86%"]

{"sheet":"County List","index":6,"n_rows":81,"n_cols":3,"rows_kept":81,"cut":false,"hidden":true,"merged":[]}
[]
[null,null,"Alcona"]
[null,null,"Alger"]
[null,null,"Allegan"]
[null,null,"Alpena"]
[null,null,"Antrim"]
[null,null,"Arenac"]
[null,null,"Baraga"]
[null,null,"Barry"]
[null,null,"Bay"]
[null,null,"Benzie"]
[null,null,"Berrien"]
[null,null,"Branch"]
[null,null,"Calhoun"]
[null,null,"Cass"]
[null,null,"Charlevoix"]
[null,null,"Cheboygan"]
[null,null,"Chippewa"]
[null,null,"Clare"]
[null,null,"Clinton"]
[null,null,"Delta"]
[null,null,"Dickinson"]
[null,null,"Eaton"]
[null,null,"Emmet"]
[null,null,"Genesee"]
[null,null,"Gladwin"]
[null,null,"Grand Traverse"]
[null,null,"Gratiot"]
[null,null,"Hillsdale"]
[null,null,"Houghton"]
[null,null,"Huron"]
[null,null,"Ingham"]
[null,null,"Ionia"]
[null,null,"Iosco"]
[null,null,"Iron"]
[null,null,"Isabella"]
[null,null,"Jackson"]
[null,null,"Kalamazoo"]
[null,null,"Kalkaska"]
[null,null,"Kent"]
[null,null,"Lake"]
[null,null,"Lapeer"]
[null,null,"Leelanau"]
[null,null,"Lenawee"]
[null,null,"Livingston"]
[null,null,"Luce"]
[null,null,"Mackinac"]
[null,null,"Macomb"]
[null,null,"Manistee"]
[null,null,"Marquette"]
[null,null,"Mason"]
[null,null,"Mecosta"]
[null,null,"Menominee"]
[null,null,"Midland"]
[null,null,"Missaukee"]
[null,null,"Monroe"]
[null,null,"Montcalm"]
[null,null,"Montmorency"]
[null,null,"Muskegon"]
[null,null,"Newaygo"]
[null,null,"Oakland"]
[null,null,"Oceana"]
[null,null,"Ogemaw"]
[null,null,"Ontonagon"]
[null,null,"Osceola"]
[null,null,"Oscoda"]
[null,null,"Otsego"]
[null,null,"Ottawa"]
[null,null,"Presque Isle"]
[null,null,"Roscommon"]
[null,null,"Saginaw"]
[null,null,"Sanilac"]
[null,null,"Schoolcraft"]
[null,null,"Shiawassee"]
[null,null,"St. Clair"]
[null,null,"St. Joseph"]
[null,null,"Tuscola"]
[null,null,"Van Buren"]
[null,null,"Washtenaw"]
[null,null,"Wayne"]
[null,null,"Wexford"]