{"text_format":"1","workbook":"xlsx","n_sheets":7,"sheets":["Users Guide","Farm Bill Calculator","MYA Prices","Background Calculations","ARC-CO Calculations","SCO Coverage","County List"],"not_rendered":{"charts":0,"images":3,"macros":1,"external_links":0,"defined_names":7,"comments":1,"pivot_tables":0},"unopened":[],"bounds":{"document_bytes":16777216,"sheet_cells":100000,"rows_first":2000,"rows_last":500,"rows_between":2000,"halvings":0,"cell_chars":16384,"cell_head_chars":4096},"cells_cut":0,"cells_raw":0,"read":"whole","date_system":"1900"}

{"sheet":"Users Guide","index":0,"n_rows":66,"n_cols":3,"rows_kept":66,"cut":false,"hidden":false,"merged":[]}
[]
[]
[]
[]
[]
[null,null,"MSU 2026 Farm Bill Analyzer USERS GUIDE"]
[null,null,"Version 1.0"]
[null,null,"Michigan State University Extension"]
[null,null,"Based on design created by Roger Betz"]
[]
[null,null,"The MSU FARM BILL ANALYZER provides an analysis of the one important decision that are included in the Agricultural Act of 2018 (the 2018 Farm Bill).  Owners and/or tenants can elect either the Agricultural Risk Coverage (ARC-CO or ARC-IC) or Price Loss Coverage (PLC) programs for each covered commodity on each of their farms."]
[]
[null,null,"This FARM BILL ANALYZER provides farm management information on the ARC Co versus PLC decisions based on assumptions about county yields and national market prices.  Given the inputted variables listed below, the MSU FARM BILL ANALYZER will calculate the consequences for the farm manager’s alternative decisions the election of ARC-CO or PLC programs. The ARC Individual (ARC-IC) program is not analyzed by the tool but is available in the Farm Bill."]
[]
[null,null,"Disclaimer: This MSU FARM BILL ANALYZER is designed with the most recent information available about the provisions of the current Farm Bill."]
{"$rows_left_out":52}
{"sheet":"Farm Bill Calculator","index":1,"n_rows":39,"n_cols":10,"rows_kept":39,"cut":false,"hidden":false,"merged":[[38,1,38,3],[3,5,3,6],[4,5,4,6],[18,4,18,8],[20,4,20,9],[16,4,16,9],[0,2,0,8],[1,2,1,8],[33,4,33,8],[37,2,37,3],[34,1,34,3],[36,0,37,0],[25,4,25,6],[28,4,28,5],[28,6,28,7],[28,8,28,9],[27,4,27,9],[35,1,35,3],[36,1,36,3]]}
[null,null,"MSU 2026 FARM BILL ANALYZER"]
[null,null,"Version 1.0"]
["Step 1. Select Farm's County"]
[null,"County Farm located:","Alcona","< Select County","Farm Name:","Smith"]
[null,null,null,null,"Farm Number:",1234]
[]
["Step 2. Enter Acres, Yields and Irrigation Percentage (from FSA CCC-861,156) for each farm"]
[null,"Commodity","Corn","Soybeans","Wheat"]
[null,"Base Acres",0,0,0,{"$f":"SUM(C9:E9)","v":0},"Total Base Acres"]
[null," PLC Yield",0,0,0]
[null,"Historical Irrigated Percentage",0,0,0]
[]
[null,null,null,null,"CORN",null,"SOYBEANS",null,"WHEAT"]
[null,null,null,"National Loan Rates",2.2000000000000002,null,6.2,null,3.38]
[null,null,null,"Effective Reference Prices",{"$f":"'Background Calculations'!T41","v":4.4234666666666662},null,{"$f":"'Background Calculations'!T42","v":10.706666666666667},null,{"$f":"'Background Calculations'!T43","v":6.35}]
{"$rows_left_out":25}
{"sheet":"MYA Prices","index":2,"n_rows":30,"n_cols":20,"rows_kept":30,"cut":false,"hidden":true,"merged":[]}
[1,2,3,4,5,6,7,8,9,10,11,12,13,14,15,16,17,18,19,20]
[null,1,2,3,4]
[null,null,"Corn 26/27","SOY 26/27","Wheat 26/27"]
[null,"CBO Baseline",4.05,9.9,5.6]
[null,"FAPRI",4.1900000000000004,10.06,5.33]
[null,"Futures '26 Harvest (as of 9/15/2025)",4.66,10.81,5.63]
[null,"Kansas State (2025/2026)",4.12,10.25,5.0599999999999996]
[null,"USDA/ERS MYA Proj (2026/2027)"]
[null,"USDA/ERS Ag Baseline Projections",4,10,5.9]
[null,"USDA/WASDE (2025/2026)",3.9,10,5.0999999999999996]
[null,"ARC-CO Benchmark Price",{"$f":"'Background Calculations'!N54","v":5.03},{"$f":"'Background Calculations'!N55","v":12.17},{"$f":"'Background Calculations'!N56","v":6.98}]
[null,"Effective Reference Prices",{"$f":"'Farm Bill Calculator'!E15","v":4.4234666666666662},{"$f":"'Farm Bill Calculator'!G15","v":10.706666666666667},{"$f":"'Farm Bill Calculator'!I15","v":6.35}]
[null,"Statutory Reference Prices",4.0999999999999996,10,6.35]
[null,"Average ",{"$f":"AVERAGEIF(C4:C10,\"<>0\")","v":4.1533333333333333},{"$f":"AVERAGEIF(D4:D10,\"<>0\")","v":10.17},{"$f":"AVERAGEIF(E4:E10,\"<>0\")","v":5.4366666666666665}]
[]
{"$rows_left_out":16}
{"sheet":"Background Calculations","index":3,"n_rows":56,"n_cols":21,"rows_kept":56,"cut":false,"hidden":true,"merged":[[12,2,12,3],[22,1,28,1]]}
[null,null,{"$f":"'Farm Bill Calculator'!C4","v":"Alcona"}]
[null,null,null,"County Trend Yield from FSA ARC-CO",2017,2018,2019,2020,2021,2022,2023,2024,2025,2026]
[null,"all","Corn",{"$f":"'Farm Bill Calculator'!$C$4&C3&B3","v":"AlconaCornall"},{"$f":"IFERROR(VLOOKUP($D3,'ARC-CO Calculations'!$B$5:$Q$289,9,0),0)","v":134.49},{"$f":"IFERROR(VLOOKUP($D3,'ARC-CO Calculations'!$B$5:$Q$289,10,0),0)","v":126.52},{"$f":"IFERROR(VLOOKUP($D3,'ARC-CO Calculations'!$B$5:$Q$289,11,0),0)","v":96.64},{"$f":"IFERROR(VLOOKUP($D3,'ARC-CO Calculations'!$B$5:$Q$289,12,0),0)","v":147.74},{"$f":"IFERROR(VLOOKUP($D3,'ARC-CO Calculations'!$B$5:$Q$289,13,0),0)","v":193.39999999999998},{"$f":"IFERROR(VLOOKUP($D3,'ARC-CO Calculations'!$B$5:$Q$289,14,0),0)","v":155.94},{"$f":"IFERROR(VLOOKUP($D3,'ARC-CO Calculations'!$B$5:$Q$289,15,0),0)","v":142.63999999999999},{"$f":"IFERROR(VLOOKUP($D3,'ARC-CO Calculations'!$B$5:$Q$289,16,0),0)","v":151.05000000000001},{"$f":"IFERROR(VLOOKUP($D3,'ARC-CO Calculations'!$B$5:$R$289,17,0),0)","v":159.45400000000001},{"$f":"IFERROR(VLOOKUP($D3,'ARC-CO Calculations'!$B$5:$S$289,18,0),0)","v":161.79679999999999}]
[null,"all","soybeans",{"$f":"'Farm Bill Calculator'!$C$4&C4&B4","v":"Alconasoybeansall"},{"$f":"IFERROR(VLOOKUP($D4,'ARC-CO Calculations'!$B$5:$Q$289,9,0),0)","v":37},{"$f":"IFERROR(VLOOKUP($D4,'ARC-CO Calculations'!$B$5:$Q$289,10,0),0)","v":35.03},{"$f":"IFERROR(VLOOKUP($D4,'ARC-CO Calculations'!$B$5:$Q$289,11,0),0)","v":35.229999999999997},{"$f":"IFERROR(VLOOKUP($D4,'ARC-CO Calculations'!$B$5:$Q$289,12,0),0)","v":38.200000000000003},{"$f":"IFERROR(VLOOKUP($D4,'ARC-CO Calculations'!$B$5:$Q$289,13,0),0)","v":46.18},{"$f":"IFERROR(VLOOKUP($D4,'ARC-CO Calculations'!$B$5:$Q$289,14,0),0)","v":41.38},{"$f":"IFERROR(VLOOKUP($D4,'ARC-CO Calculations'!$B$5:$Q$289,15,0),0)","v":30.82},{"$f":"IFERROR(VLOOKUP($D4,'ARC-CO Calculations'!$B$5:$Q$289,16,0),0)","v":18.32},{"$f":"IFERROR(VLOOKUP($D4,'ARC-CO Calculations'!$B$5:$R$289,17,0),0)","v":34.979999999999997},{"$f":"IFERROR(VLOOKUP($D4,'ARC-CO Calculations'!$B$5:$S$289,18,0),0)","v":34.335999999999999}]
[null,"all","Wheat",{"$f":"'Farm Bill Calculator'!$C$4&C5&B5","v":"AlconaWheatall"},{"$f":"IFERROR(VLOOKUP($D5,'ARC-CO Calculations'!$B$5:$Q$289,9,0),0)","v":49.32},{"$f":"IFERROR(VLOOKUP($D5,'ARC-CO Calculations'!$B$5:$Q$289,10,0),0)","v":47.83},{"$f":"IFERROR(VLOOKUP($D5,'ARC-CO Calculations'!$B$5:$Q$289,11,0),0)","v":58.66},{"$f":"IFERROR(VLOOKUP($D5,'ARC-CO Calculations'!$B$5:$Q$289,12,0),0)","v":59.68},{"$f":"IFERROR(VLOOKUP($D5,'ARC-CO Calculations'!$B$5:$Q$289,13,0),0)","v":53.93},{"$f":"IFERROR(VLOOKUP($D5,'ARC-CO Calculations'!$B$5:$Q$289,14,0),0)","v":67.72},{"$f":"IFERROR(VLOOKUP($D5,'ARC-CO Calculations'!$B$5:$Q$289,15,0),0)","v":65.42},{"$f":"IFERROR(VLOOKUP($D5,'ARC-CO Calculations'!$B$5:$Q$289,16,0),0)","v":69.3},{"$f":"IFERROR(VLOOKUP($D5,'ARC-CO Calculations'!$B$5:$R$289,17,0),0)","v":63.82},{"$f":"IFERROR(VLOOKUP($D5,'ARC-CO Calculations'!$B$5:$S$289,18,0),0)","v":64.647999999999996}]
[null,"Irrigated","Corn",{"$f":"'Farm Bill Calculator'!$C$4&C6&B6","v":"AlconaCornIrrigated"},{"$f":"IFERROR(VLOOKUP($D6,'ARC-CO Calculations'!$B$5:$Q$289,9,0),0)","v":0},{"$f":"IFERROR(VLOOKUP($D6,'ARC-CO Calculations'!$B$5:$Q$289,10,0),0)","v":0},{"$f":"IFERROR(VLOOKUP($D6,'ARC-CO Calculations'!$B$5:$Q$289,11,0),0)","v":0},{"$f":"IFERROR(VLOOKUP($D6,'ARC-CO Calculations'!$B$5:$Q$289,12,0),0)","v":0},{"$f":"IFERROR(VLOOKUP($D6,'ARC-CO Calculations'!$B$5:$Q$289,13,0),0)","v":0},{"$f":"IFERROR(VLOOKUP($D6,'ARC-CO Calculations'!$B$5:$Q$289,14,0),0)","v":0},{"$f":"IFERROR(VLOOKUP($D6,'ARC-CO Calculations'!$B$5:$Q$289,15,0),0)","v":0},{"$f":"IFERROR(VLOOKUP($D6,'ARC-CO Calculations'!$B$5:$Q$289,16,0),0)","v":0},{"$f":"IFERROR(VLOOKUP($D6,'ARC-CO Calculations'!$B$5:$R$289,17,0),0)","v":0},{"$f":"IFERROR(VLOOKUP($D6,'ARC-CO Calculations'!$B$5:$S$289,18,0),0)","v":0}]
[null,"Irrigated","soybeans",{"$f":"'Farm Bill Calculator'!$C$4&C7&B7","v":"AlconasoybeansIrrigated"},{"$f":"IFERROR(VLOOKUP($D7,'ARC-CO Calculations'!$B$5:$Q$289,9,0),0)","v":0},{"$f":"IFERROR(VLOOKUP($D7,'ARC-CO Calculations'!$B$5:$Q$289,10,0),0)","v":0},{"$f":"IFERROR(VLOOKUP($D7,'ARC-CO Calculations'!$B$5:$Q$289,11,0),0)","v":0},{"$f":"IFERROR(VLOOKUP($D7,'ARC-CO Calculations'!$B$5:$Q$289,12,0),0)","v":0},{"$f":"IFERROR(VLOOKUP($D7,'ARC-CO Calculations'!$B$5:$Q$289,13,0),0)","v":0},{"$f":"IFERROR(VLOOKUP($D7,'ARC-CO Calculations'!$B$5:$Q$289,14,0),0)","v":0},{"$f":"IFERROR(VLOOKUP($D7,'ARC-CO Calculations'!$B$5:$Q$289,15,0),0)","v":0},{"$f":"IFERROR(VLOOKUP($D7,'ARC-CO Calculations'!$B$5:$Q$289,16,0),0)","v":0},{"$f":"IFERROR(VLOOKUP($D7,'ARC-CO Calculations'!$B$5:$R$289,17,0),0)","v":0},{"$f":"IFERROR(VLOOKUP($D7,'ARC-CO Calculations'!$B$5:$S$289,18,0),0)","v":0}]
[null,"nonirrigated","Corn",{"$f":"'Farm Bill Calculator'!$C$4&C8&B8","v":"AlconaCornnonirrigated"},{"$f":"IFERROR(VLOOKUP($D8,'ARC-CO Calculations'!$B$5:$Q$289,9,0),0)","v":0},{"$f":"IFERROR(VLOOKUP($D8,'ARC-CO Calculations'!$B$5:$Q$289,10,0),0)","v":0},{"$f":"IFERROR(VLOOKUP($D8,'ARC-CO Calculations'!$B$5:$Q$289,11,0),0)","v":0},{"$f":"IFERROR(VLOOKUP($D8,'ARC-CO Calculations'!$B$5:$Q$289,12,0),0)","v":0},{"$f":"IFERROR(VLOOKUP($D8,'ARC-CO Calculations'!$B$5:$Q$289,13,0),0)","v":0},{"$f":"IFERROR(VLOOKUP($D8,'ARC-CO Calculations'!$B$5:$Q$289,14,0),0)","v":0},{"$f":"IFERROR(VLOOKUP($D8,'ARC-CO Calculations'!$B$5:$Q$289,15,0),0)","v":0},{"$f":"IFERROR(VLOOKUP($D8,'ARC-CO Calculations'!$B$5:$Q$289,16,0),0)","v":0},{"$f":"IFERROR(VLOOKUP($D8,'ARC-CO Calculations'!$B$5:$R$289,17,0),0)","v":0},{"$f":"IFERROR(VLOOKUP($D8,'ARC-CO Calculations'!$B$5:$S$289,18,0),0)","v":0}]
[null,"nonirrigated","soybeans",{"$f":"'Farm Bill Calculator'!$C$4&C9&B9","v":"Alconasoybeansnonirrigated"},{"$f":"IFERROR(VLOOKUP($D9,'ARC-CO Calculations'!$B$5:$Q$289,9,0),0)","v":0},{"$f":"IFERROR(VLOOKUP($D9,'ARC-CO Calculations'!$B$5:$Q$289,10,0),0)","v":0},{"$f":"IFERROR(VLOOKUP($D9,'ARC-CO Calculations'!$B$5:$Q$289,11,0),0)","v":0},{"$f":"IFERROR(VLOOKUP($D9,'ARC-CO Calculations'!$B$5:$Q$289,12,0),0)","v":0},{"$f":"IFERROR(VLOOKUP($D9,'ARC-CO Calculations'!$B$5:$Q$289,13,0),0)","v":0},{"$f":"IFERROR(VLOOKUP($D9,'ARC-CO Calculations'!$B$5:$Q$289,14,0),0)","v":0},{"$f":"IFERROR(VLOOKUP($D9,'ARC-CO Calculations'!$B$5:$Q$289,15,0),0)","v":0},{"$f":"IFERROR(VLOOKUP($D9,'ARC-CO Calculations'!$B$5:$Q$289,16,0),0)","v":0},{"$f":"IFERROR(VLOOKUP($D9,'ARC-CO Calculations'!$B$5:$R$289,17,0),0)","v":0},{"$f":"IFERROR(VLOOKUP($D9,'ARC-CO Calculations'!$B$5:$S$289,18,0),0)","v":0}]
[null,"Irrigated","Wheat",{"$f":"'Farm Bill Calculator'!$C$4&C10&B10","v":"AlconaWheatIrrigated"},{"$f":"IFERROR(VLOOKUP($D10,'ARC-CO Calculations'!$B$5:$Q$289,9,0),0)","v":0},{"$f":"IFERROR(VLOOKUP($D10,'ARC-CO Calculations'!$B$5:$Q$289,10,0),0)","v":0},{"$f":"IFERROR(VLOOKUP($D10,'ARC-CO Calculations'!$B$5:$Q$289,11,0),0)","v":0},{"$f":"IFERROR(VLOOKUP($D10,'ARC-CO Calculations'!$B$5:$Q$289,12,0),0)","v":0},{"$f":"IFERROR(VLOOKUP($D10,'ARC-CO Calculations'!$B$5:$Q$289,13,0),0)","v":0},{"$f":"IFERROR(VLOOKUP($D10,'ARC-CO Calculations'!$B$5:$Q$289,14,0),0)","v":0},{"$f":"IFERROR(VLOOKUP($D10,'ARC-CO Calculations'!$B$5:$Q$289,15,0),0)","v":0},{"$f":"IFERROR(VLOOKUP($D10,'ARC-CO Calculations'!$B$5:$Q$289,16,0),0)","v":0},{"$f":"IFERROR(VLOOKUP($D10,'ARC-CO Calculations'!$B$5:$R$289,17,0),0)","v":0},{"$f":"IFERROR(VLOOKUP($D10,'ARC-CO Calculations'!$B$5:$S$289,18,0),0)","v":0}]
[null,"nonirrigated","Wheat",{"$f":"'Farm Bill Calculator'!$C$4&C11&B11","v":"AlconaWheatnonirrigated"},{"$f":"IFERROR(VLOOKUP($D11,'ARC-CO Calculations'!$B$5:$Q$289,9,0),0)","v":0},{"$f":"IFERROR(VLOOKUP($D11,'ARC-CO Calculations'!$B$5:$Q$289,10,0),0)","v":0},{"$f":"IFERROR(VLOOKUP($D11,'ARC-CO Calculations'!$B$5:$Q$289,11,0),0)","v":0},{"$f":"IFERROR(VLOOKUP($D11,'ARC-CO Calculations'!$B$5:$Q$289,12,0),0)","v":0},{"$f":"IFERROR(VLOOKUP($D11,'ARC-CO Calculations'!$B$5:$Q$289,13,0),0)","v":0},{"$f":"IFERROR(VLOOKUP($D11,'ARC-CO Calculations'!$B$5:$Q$289,14,0),0)","v":0},{"$f":"IFERROR(VLOOKUP($D11,'ARC-CO Calculations'!$B$5:$Q$289,15,0),0)","v":0},{"$f":"IFERROR(VLOOKUP($D11,'ARC-CO Calculations'!$B$5:$Q$289,16,0),0)","v":0},{"$f":"IFERROR(VLOOKUP($D11,'ARC-CO Calculations'!$B$5:$R$289,17,0),0)","v":0},{"$f":"IFERROR(VLOOKUP($D11,'ARC-CO Calculations'!$B$5:$S$289,18,0),0)","v":0}]
[]
[null,null,"County Olympic Average Yield ARC-CO",null,2017,2018,2019,2020,2021,2022,2023,2024,2025,2026]
[null,null,"Corn",{"$f":"D3","v":"AlconaCornall"},null,null,{"$f":"(SUM(E3:E3)-MAX(E3:E3)-MIN(E3:E3))/3","v":-44.830000000000005},{"$f":"(SUM(E3:F3)-MAX(E3:F3)-MIN(E3:F3))/3","v":-4.736951571734001E-15},{"$f":"(SUM(E3:G3)-MAX(E3:G3)-MIN(E3:G3))/3","v":42.173333333333325},{"$f":"(SUM(E3:H3)-MAX(E3:H3)-MIN(E3:H3))/3","v":87.00333333333333},{"$f":"(SUM(E3:I3)-MAX(E3:I3)-MIN(E3:I3))/3","v":136.25},{"$f":"(SUM(F3:J3)-MAX(F3:J3)-MIN(F3:J3))/3","v":143.4},{"$f":"(SUM(G3:K3)-MAX(G3:K3)-MIN(G3:K3))/3","v":148.77333333333334},{"$f":"(SUM(H3:L3)-MAX(H3:L3)-MIN(H3:L3))/3","v":151.57666666666668}]
[null,null,"soybeans","Alconasoybeansall",null,null,{"$f":"((SUM(E4:E4)-MAX(E4:E4)-MIN(E4:E4)))/3","v":-12.333333333333334},{"$f":"(SUM(E4:F4)-MAX(E4:F4)-MIN(E4:F4))/3","v":0},{"$f":"(SUM(E4:G4)-MAX(E4:G4)-MIN(E4:G4))/3","v":11.743333333333331},24.076666666666657,{"$f":"(SUM(E4:I4)-MAX(E4:I4)-MIN(E4:I4))/3","v":36.809999999999995},{"$f":"(SUM(F4:J4)-MAX(F4:J4)-MIN(F4:J4))/3","v":38.269999999999989},{"$f":"(SUM(G4:K4)-MAX(G4:K4)-MIN(G4:K4))/3","v":38.270000000000003},{"$f":"(SUM(H4:L4)-MAX(H4:L4)-MIN(H4:L4))/3","v":36.79999999999999}]
{"$rows_left_out":42}
{"sheet":"ARC-CO Calculations","index":4,"n_rows":289,"n_cols":31,"rows_kept":289,"cut":false,"hidden":true,"merged":[]}
[null,null,"ARC-CO TREND ADJUSTED YIELDS, BENCHMARK YIELDS AND GUARANTEE REVENUES FOR PROGRAM YEAR 2025",null,null,null,null,null,null,null,null,null,null,null,null,null,null,null,null,null,null,"PROJECTED Program Year 2025 Benchmark Yields and Revenues"]
[null,null,null,null,null,null,null,null,null,null,null,null,null,null,null,null,null,null,null,null,null,"A","B","C","D","E","F","G","H","I","J"]
[null,{"$f":"'Farm Bill Calculator'!C4","v":"Alcona"},null,null,null,null,null,null,null,null,null,null,null,null,null,null,null,null,null,null,null,null,null,"(A * B)","(90% of C)","(12% of C)",null,null,"(F * G)","(D - H), not less than 0","Lesser of E or I (capped at 12% of Benchmark)"]
[null,null,"ST_Cty","State Name","County Name","Sub County","Crop Name","Unit","ARC-CO Yield Designation","2017 trend adjusted (county yield or 80% of T)","2018 trend adjusted (county yield or 80% of T)","2019 trend adjusted (county yield or 80% of T)","2020 trend adjusted (county yield or 80% of T)","2021 trend adjusted (county yield or 80% of T)","2022 trend adjusted (county yield or 80% of T)","2023 trend adjusted (county yield or 80% of T)","2024 trend adjusted (county yield or 80% of T)","Projected 2025 trend adjusted (county yield or 80% of T)","Projected 2026 trend adjusted (county yield or 80% of T)","Trend adjustments 2025",null,"2026 Bench Mark (2019-23 olympic avg)","2026 Bench Mark Price (2018-22 olympic avg)","2026 Benchmark Revenue","2026 Guarantee Revenue","2026 Maximum Payment Rate","Projected 2026 Actual Yield","Projected 2026 National Price","Projected 2026 Actual Revenue","Projected 2026 Formula Payment Rate","Projected 2026 ARC-CO Payment Rate"]
[null,{"$f":"E5&G5&I5","v":"AlconaCornAll"},"26001","Michigan","Alcona","","Corn","Bushel","All",134.49,126.52,96.64,147.74,193.39999999999998,155.94,142.63999999999999,151.05000000000001,{"$f":"AVERAGE(M5:Q5)+T5","v":159.45400000000001},{"$f":"AVERAGE(N5:R5)+T5","v":161.79679999999999},1.3,null,{"$f":"(SUM(M5:Q5)-MIN(M5:Q5)-MAX(M5:Q5))/(COUNT(M5:Q5)-2)","v":151.57666666666668},{"$f":"'Background Calculations'!$M$54","v":5.03},{"$f":"V5*W5","v":762.4306333333335},{"$f":"X5*0.9","v":686.18757000000016},{"$f":"X5*0.12","v":91.491676000000012},{"$f":"'Farm Bill Calculator'!$E$22","v":151.57666666666668},{"$f":"'Farm Bill Calculator'!$E$30","v":4.12},{"$f":"AB5*AA5","v":624.49586666666676},{"$f":"IF(Y5-AC5>0,Y5-AC5,0)","v":61.691703333333407},{"$f":"MIN(AD5,Z5)","v":61.691703333333407}]
[null,"AlgerCornAll","26001","Michigan","Alger","","Corn","Bushel","All",58.4,111,58.49,183.9,110.84,79.53,170.04,65.44,{"$f":"AVERAGE(M6:Q6)+T6","v":121.95},{"$f":"AVERAGE(N6:R6)+T6","v":109.55999999999999},null,null,{"$f":"(SUM(M6:Q6)-MIN(M6:Q6)-MAX(M6:Q6))/(COUNT(M6:Q6)-2)","v":120.13666666666666},{"$f":"'Background Calculations'!$M$54","v":5.03},{"$f":"V6*W6","v":604.2874333333333},{"$f":"X6*0.9","v":543.85869000000002},{"$f":"X6*0.12","v":72.51449199999999},{"$f":"'Farm Bill Calculator'!$E$22","v":151.57666666666668},{"$f":"'Farm Bill Calculator'!$E$30","v":4.12},{"$f":"AB6*AA6","v":624.49586666666676},{"$f":"IF(Y6-AC6>0,Y6-AC6,0)","v":0},{"$f":"MIN(AD6,Z6)","v":0}]
[null,"AlleganCornIrrigated","26001","Michigan","Allegan","","Corn","Bushel","Irrigated",231.01,210.20999999999998,201.81,215.59,210.51,218.26999999999998,235.93,238.09,{"$f":"AVERAGE(M7:Q7)+T7","v":225.33799999999997},227.28759999999997,1.66,null,223.26333333333329,{"$f":"'Background Calculations'!$M$54","v":5.03},1123.0145666666665,1010.7131099999999,134.76174799999998,{"$f":"'Farm Bill Calculator'!$E$22","v":151.57666666666668},{"$f":"'Farm Bill Calculator'!$E$30","v":4.12},624.49586666666676,386.21724333333316,134.76174799999998]
[null,"AlleganCornNonirrigated","26003","Michigan","Allegan","","Corn","Bushel","Nonirrigated",187.24,160.18,162.63999999999999,174.56,185.42,189.18,189.85999999999999,202.06,189.78600000000003,192.8312,1.57,null,188.15333333333342,{"$f":"'Background Calculations'!$M$54","v":5.03},946.41126666666719,851.77014000000054,113.56935200000005,{"$f":"'Farm Bill Calculator'!$E$22","v":151.57666666666668},{"$f":"'Farm Bill Calculator'!$E$30","v":4.12},624.49586666666676,227.27427333333378,113.56935200000005]
[null,"AlpenaCornAll","26003","Michigan","Alpena","","Corn","Bushel","All",150.15,116.72999999999999,124.9,169.39,191.82000000000002,152.13,158.41,138.68,163.60600000000002,162.44919999999999,1.52,null,159.97666666666666,{"$f":"'Background Calculations'!$M$54","v":5.03},804.68263333333334,724.21437000000003,96.561915999999997,{"$f":"'Farm Bill Calculator'!$E$22","v":151.57666666666668},{"$f":"'Farm Bill Calculator'!$E$30","v":4.12},624.49586666666676,99.718503333333274,96.561915999999997]
[null,"AntrimCornAll","26005","Michigan","Antrim","","Corn","Bushel","All",140.73000000000002,115.55,97.14,149.22999999999999,144.06,88.27,150.22,136.78,134.60199999999998,131.67639999999997,0.89,null,143.35666666666665,{"$f":"'Background Calculations'!$M$54","v":5.03},721.08403333333331,648.97563000000002,86.530083999999988,{"$f":"'Farm Bill Calculator'!$E$22","v":151.57666666666668},{"$f":"'Farm Bill Calculator'!$E$30","v":4.12},624.49586666666676,24.479763333333267,24.479763333333267]
[null,"ArenacCornAll","26005","Michigan","Arenac","","Corn","Bushel","All",175.67999999999998,174.92,145.34,155.76,195.7,163.98999999999998,183.99,177.78,177.08399999999997,181.34879999999995,1.64,null,175.25333333333333,{"$f":"'Background Calculations'!$M$54","v":5.03},881.52426666666668,793.37184000000002,105.782912,{"$f":"'Farm Bill Calculator'!$E$22","v":151.57666666666668},{"$f":"'Farm Bill Calculator'!$E$30","v":4.12},624.49586666666676,168.87597333333326,105.782912]
[null,"BaragaCornAll","26005","Michigan","Baraga","","Corn","Bushel","All",84,111,84,140.19999999999999,110.84,84,170.04,65.44,114.104,108.8848,null,null,111.67999999999999,{"$f":"'Background Calculations'!$M$54","v":5.03},561.75040000000001,505.57536000000005,67.410048000000003,{"$f":"'Farm Bill Calculator'!$E$22","v":151.57666666666668},{"$f":"'Farm Bill Calculator'!$E$30","v":4.12},624.49586666666676,0,0]
[null,"BarryCornIrrigated","26005","Michigan","Barry","","Corn","Bushel","Irrigated",205.67000000000002,192.86999999999998,182.63,215.64000000000001,224.51,213.3,211.61,226.68,219.62800000000001,220.4256,1.28,null,217.81666666666669,{"$f":"'Background Calculations'!$M$54","v":5.03},1095.6178333333335,986.05605000000014,131.47414000000001,{"$f":"'Farm Bill Calculator'!$E$22","v":151.57666666666668},{"$f":"'Farm Bill Calculator'!$E$30","v":4.12},624.49586666666676,361.56018333333338,131.47414000000001]
[null,"BarryCornNonirrigated","26005","Michigan","Barry","","Corn","Bushel","Nonirrigated",174.37,150.64000000000001,143.56,166.73,181.76000000000002,181.72,168.35999999999999,197.44,180.44200000000001,183.18440000000001,1.24,null,177.27999999999997,{"$f":"'Background Calculations'!$M$54","v":5.03},891.71839999999986,802.54655999999989,107.00620799999997,{"$f":"'Farm Bill Calculator'!$E$22","v":151.57666666666668},{"$f":"'Farm Bill Calculator'!$E$30","v":4.12},624.49586666666676,178.05069333333313,107.00620799999997]
[null,"BayCornIrrigated","26007","Michigan","Bay","","Corn","Bushel","Irrigated",190,205.41000000000003,185.26,199.03,213.09,192.51000000000002,186.85,193.01,198.738,198.67960000000002,1.84,null,194.85,{"$f":"'Background Calculations'!$M$54","v":5.03},980.09550000000002,882.08595000000003,117.61145999999999,{"$f":"'Farm Bill Calculator'!$E$22","v":151.57666666666668},{"$f":"'Farm Bill Calculator'!$E$30","v":4.12},624.49586666666676,257.59008333333327,117.61145999999999]
{"$rows_left_out":275}
{"sheet":"SCO Coverage","index":5,"n_rows":9,"n_cols":2,"rows_kept":9,"cut":false,"hidden":true,"merged":[]}
[null,0]
[null,"85-86%"]
[null,"80-86%"]
[null,"75-86%"]
[null,"70-86%"]
[null,"65-86%"]
[null,"60-86%"]
[null,"55-86%"]
[null,"50-86%"]

{"sheet":"County List","index":6,"n_rows":81,"n_cols":3,"rows_kept":81,"cut":false,"hidden":true,"merged":[]}
[]
[null,null,"Alcona"]
[null,null,"Alger"]
[null,null,"Allegan"]
[null,null,"Alpena"]
[null,null,"Antrim"]
[null,null,"Arenac"]
[null,null,"Baraga"]
[null,null,"Barry"]
[null,null,"Bay"]
[null,null,"Benzie"]
[null,null,"Berrien"]
[null,null,"Branch"]
[null,null,"Calhoun"]
[null,null,"Cass"]
{"$rows_left_out":66}